Skip to content

Console Output

Started by upstream project "BIOFORMATS-test-repo" build number 50
originally caused by:
 Started by upstream project "Trigger" build number 57
 originally caused by:
  Started by timer
Running as SYSTEM
Building remotely on docker (swarm) in workspace /home/omero/workspace/BIOFORMATS-test-folder@6
[BIOFORMATS-test-folder@6] $ /bin/bash -xe /tmp/jenkins10496472401708592268.sh
+ '[' flex = slidebook ']'
++ date +%u
+ '[' 3 -le 1 ']'
+ sudo docker run --rm --name BIOFORMATS-test-folder_7246_merge_ci -v /uod/idr/repos/curated/flex:/data -v /uod/idr-scratch/merge-ci/curated/flex:/config snoopycrimecop/bioformats:merge_ci -Dtestng.memory=15g -Dtestng.threadCount=12
Buildfile: /bio-formats-build/bioformats/components/test-suite/build.xml
     [echo] isSnapshot = true

init-title:
     [echo] ----------=========== bio-formats-testing-framework ===========----------

init-timestamp:

init:

copy-resources:

compile:
[resolver:resolve] Resolving artifacts

compile-tests:
[resolver:resolve] Resolving artifacts
    [javac] Compiling 1 source file to /bio-formats-build/bioformats/components/test-suite/test
    [javac] warning: [options] bootstrap class path not set in conjunction with -source 8
    [javac] 1 warning

test-automated:
   [testng] Could not load field socket from SocketImpl: java.lang.NoSuchFieldException: socket
   [testng] Could not load field serverSocket from SocketImpl: java.lang.NoSuchFieldException: serverSocket
   [testng] File leak detector installed
   [testng] 01:30:41,961 |-INFO in ch.qos.logback.classic.LoggerContext[default] - This is logback-classic version 1.3.14
   [testng] 01:30:41,963 |-INFO in ch.qos.logback.classic.util.ContextInitializer@d6e7bab - No custom configurators were discovered as a service.
   [testng] 01:30:41,963 |-INFO in ch.qos.logback.classic.util.ContextInitializer@d6e7bab - Trying to configure with ch.qos.logback.classic.joran.SerializedModelConfigurator
   [testng] 01:30:41,964 |-INFO in ch.qos.logback.classic.util.ContextInitializer@d6e7bab - Constructed configurator of type class ch.qos.logback.classic.joran.SerializedModelConfigurator
   [testng] 01:30:41,964 |-INFO in ch.qos.logback.classic.LoggerContext[default] - Could NOT find resource [logback-test.scmo]
   [testng] 01:30:41,965 |-INFO in ch.qos.logback.classic.LoggerContext[default] - Could NOT find resource [logback.scmo]
   [testng] 01:30:41,965 |-INFO in ch.qos.logback.classic.util.ContextInitializer@d6e7bab - ch.qos.logback.classic.joran.SerializedModelConfigurator.configure() call lasted 1 milliseconds. ExecutionStatus=INVOKE_NEXT_IF_ANY
   [testng] 01:30:41,965 |-INFO in ch.qos.logback.classic.util.ContextInitializer@d6e7bab - Trying to configure with ch.qos.logback.classic.util.DefaultJoranConfigurator
   [testng] 01:30:41,966 |-INFO in ch.qos.logback.classic.util.ContextInitializer@d6e7bab - Constructed configurator of type class ch.qos.logback.classic.util.DefaultJoranConfigurator
   [testng] 01:30:41,966 |-INFO in ch.qos.logback.classic.LoggerContext[default] - Could NOT find resource [${logback.configurationFile}]
   [testng] 01:30:41,967 |-INFO in ch.qos.logback.classic.LoggerContext[default] - Could NOT find resource [logback-test.xml]
   [testng] 01:30:41,967 |-INFO in ch.qos.logback.classic.LoggerContext[default] - Found resource [logback.xml] at [file:/bio-formats-build/bioformats/components/test-suite/logback.xml]
   [testng] 01:30:42,152 |-INFO in ch.qos.logback.core.model.processor.AppenderModelHandler - Processing appender named [stdout]
   [testng] 01:30:42,152 |-INFO in ch.qos.logback.core.model.processor.AppenderModelHandler - About to instantiate appender of type [ch.qos.logback.core.ConsoleAppender]
   [testng] 01:30:42,175 |-INFO in ch.qos.logback.core.model.processor.AppenderModelHandler - Processing appender named [SIFT]
   [testng] 01:30:42,175 |-INFO in ch.qos.logback.core.model.processor.AppenderModelHandler - About to instantiate appender of type [ch.qos.logback.classic.sift.SiftingAppender]
   [testng] 01:30:42,181 |-INFO in ch.qos.logback.classic.model.processor.LoggerModelHandler - Setting level of logger [loci.tests.testng] to DEBUG
   [testng] 01:30:42,181 |-INFO in ch.qos.logback.classic.model.processor.RootLoggerModelHandler - Setting level of ROOT logger to INFO
   [testng] 01:30:42,182 |-INFO in ch.qos.logback.core.model.processor.AppenderRefModelHandler - Attaching appender named [SIFT] to Logger[ROOT]
   [testng] 01:30:42,182 |-INFO in ch.qos.logback.core.model.processor.AppenderRefModelHandler - Attaching appender named [stdout] to Logger[loci.tests.testng]
   [testng] 01:30:42,182 |-INFO in ch.qos.logback.core.model.processor.DefaultProcessor@576d5deb - End of configuration.
   [testng] 01:30:42,183 |-INFO in ch.qos.logback.classic.joran.JoranConfigurator@6fdbe764 - Registering current configuration as safe fallback point
   [testng] 01:30:42,183 |-INFO in ch.qos.logback.classic.util.ContextInitializer@d6e7bab - ch.qos.logback.classic.util.DefaultJoranConfigurator.configure() call lasted 217 milliseconds. ExecutionStatus=DO_NOT_INVOKE_NEXT_IF_ANY
   [testng] [2024-05-01 01:30:42,193] [main] java.version = 17.0.2
   [testng] 01:30:42,197 |-INFO in ch.qos.logback.core.model.processor.AppenderModelHandler - Processing appender named [logfile-main]
   [testng] 01:30:42,197 |-INFO in ch.qos.logback.core.model.processor.AppenderModelHandler - About to instantiate appender of type [loci.tests.testng.TimestampedLogFileAppender]
   [testng] 01:30:42,240 |-INFO in loci.tests.testng.TimestampedLogFileAppender[logfile-main] - File property is set to [target/bio-formats-test-main-2024-05-01_01-30-42.log]
   [testng] 01:30:42,242 |-INFO in ch.qos.logback.core.sift.SiftProcessor@37313c65 - End of configuration.
   [testng] [2024-05-01 01:30:42,245] [main] testng.directory = /data
   [testng] [2024-05-01 01:30:42,245] [main] testng.configDirectory = /config
   [testng] [2024-05-01 01:30:42,253] [main] testng.multiplier = 1.0
   [testng] [2024-05-01 01:30:42,254] [main] testng.in-memory = false
   [testng] [2024-05-01 01:30:42,254] [main] testng.allow-missing = false
   [testng] [2024-05-01 01:30:42,254] [main] user.language = en
   [testng] [2024-05-01 01:30:42,254] [main] user.country = ${user.country}
   [testng] [2024-05-01 01:30:42,254] [main] Maximum heap size = 15360 MB
   [testng] Scanning for files...
   [testng] [2024-05-01 01:30:54,587] [main] ----------------------------------------
   [testng] [2024-05-01 01:30:54,587] [main] Total files: 791
   [testng] [2024-05-01 01:30:54,588] [main] Scan time: 12.332 s (15 ms/file)
   [testng] [2024-05-01 01:30:54,588] [main] ----------------------------------------
   [testng] Building list of tests...
   [testng] Ready to test 42 files
   [testng] [TestNG] Running:
   [testng]   Bio-Formats software test suite
   [testng] 
   [testng] [2024-05-01 01:36:58,826] [pool-1-thread-1] Initializing /data/lee/RLM1 SSN3 300308 008015000.flex: 
   [testng] 01:36:58,826 |-INFO in ch.qos.logback.core.model.processor.AppenderModelHandler - Processing appender named [logfile-pool-1-thread-1]
   [testng] 01:36:58,826 |-INFO in ch.qos.logback.core.model.processor.AppenderModelHandler - About to instantiate appender of type [loci.tests.testng.TimestampedLogFileAppender]
   [testng] 01:36:58,827 |-INFO in loci.tests.testng.TimestampedLogFileAppender[logfile-pool-1-thread-1] - File property is set to [target/bio-formats-test-pool-1-thread-1-2024-05-01_01-36-58.log]
   [testng] 01:36:58,828 |-INFO in ch.qos.logback.core.sift.SiftProcessor@549f949b - End of configuration.
   [testng] [2024-05-01 01:36:58,867] [pool-1-thread-12] Initializing /data/qa-18096/002002001.flex: 
   [testng] 01:36:58,867 |-INFO in ch.qos.logback.core.model.processor.AppenderModelHandler - Processing appender named [logfile-pool-1-thread-12]
   [testng] 01:36:58,867 |-INFO in ch.qos.logback.core.model.processor.AppenderModelHandler - About to instantiate appender of type [loci.tests.testng.TimestampedLogFileAppender]
   [testng] 01:36:58,868 |-INFO in loci.tests.testng.TimestampedLogFileAppender[logfile-pool-1-thread-12] - File property is set to [target/bio-formats-test-pool-1-thread-12-2024-05-01_01-36-58.log]
   [testng] 01:36:58,868 |-INFO in ch.qos.logback.core.sift.SiftProcessor@17b15b78 - End of configuration.
   [testng] [2024-05-01 01:36:58,926] [pool-1-thread-11] Initializing /data/anatole/001004000.flex: 
   [testng] 01:36:58,926 |-INFO in ch.qos.logback.core.model.processor.AppenderModelHandler - Processing appender named [logfile-pool-1-thread-11]
   [testng] 01:36:58,926 |-INFO in ch.qos.logback.core.model.processor.AppenderModelHandler - About to instantiate appender of type [loci.tests.testng.TimestampedLogFileAppender]
   [testng] 01:36:58,927 |-INFO in loci.tests.testng.TimestampedLogFileAppender[logfile-pool-1-thread-11] - File property is set to [target/bio-formats-test-pool-1-thread-11-2024-05-01_01-36-58.log]
   [testng] 01:36:58,927 |-INFO in ch.qos.logback.core.sift.SiftProcessor@5d2a3847 - End of configuration.
   [testng] [2024-05-01 01:36:58,998] [pool-1-thread-10] Initializing /data/qa-7469/002002.flex: 
   [testng] 01:36:58,999 |-INFO in ch.qos.logback.core.model.processor.AppenderModelHandler - Processing appender named [logfile-pool-1-thread-10]
   [testng] 01:36:58,999 |-INFO in ch.qos.logback.core.model.processor.AppenderModelHandler - About to instantiate appender of type [loci.tests.testng.TimestampedLogFileAppender]
   [testng] 01:36:59,000 |-INFO in loci.tests.testng.TimestampedLogFileAppender[logfile-pool-1-thread-10] - File property is set to [target/bio-formats-test-pool-1-thread-10-2024-05-01_01-36-59.log]
   [testng] 01:36:59,001 |-INFO in ch.qos.logback.core.sift.SiftProcessor@524de17f - End of configuration.
   [testng] [2024-05-01 01:36:59,063] [pool-1-thread-9] Initializing /data/public/idr0001/X_110331_S13/Meas_04(2011-03-31_13-55-29)/001002000.flex: 
   [testng] 01:36:59,063 |-INFO in ch.qos.logback.core.model.processor.AppenderModelHandler - Processing appender named [logfile-pool-1-thread-9]
   [testng] 01:36:59,063 |-INFO in ch.qos.logback.core.model.processor.AppenderModelHandler - About to instantiate appender of type [loci.tests.testng.TimestampedLogFileAppender]
   [testng] 01:36:59,063 |-INFO in loci.tests.testng.TimestampedLogFileAppender[logfile-pool-1-thread-9] - File property is set to [target/bio-formats-test-pool-1-thread-9-2024-05-01_01-36-59.log]
   [testng] 01:36:59,064 |-INFO in ch.qos.logback.core.sift.SiftProcessor@3f690185 - End of configuration.
   [testng] [2024-05-01 01:36:59,539] [pool-1-thread-8] Initializing /data/public/idr0001/X_110331_S13/Meas_03(2011-03-31_13-14-40)/001001000.flex: 
   [testng] 01:36:59,539 |-INFO in ch.qos.logback.core.model.processor.AppenderModelHandler - Processing appender named [logfile-pool-1-thread-8]
   [testng] 01:36:59,539 |-INFO in ch.qos.logback.core.model.processor.AppenderModelHandler - About to instantiate appender of type [loci.tests.testng.TimestampedLogFileAppender]
   [testng] 01:36:59,540 |-INFO in loci.tests.testng.TimestampedLogFileAppender[logfile-pool-1-thread-8] - File property is set to [target/bio-formats-test-pool-1-thread-8-2024-05-01_01-36-59.log]
   [testng] 01:36:59,540 |-INFO in ch.qos.logback.core.sift.SiftProcessor@566e32b9 - End of configuration.
   [testng] [2024-05-01 01:36:59,988] [pool-1-thread-7] Initializing /data/tony/000101400 - from PE sofwatre.tif: 
   [testng] 01:36:59,988 |-INFO in ch.qos.logback.core.model.processor.AppenderModelHandler - Processing appender named [logfile-pool-1-thread-7]
   [testng] 01:36:59,988 |-INFO in ch.qos.logback.core.model.processor.AppenderModelHandler - About to instantiate appender of type [loci.tests.testng.TimestampedLogFileAppender]
   [testng] 01:36:59,989 |-INFO in loci.tests.testng.TimestampedLogFileAppender[logfile-pool-1-thread-7] - File property is set to [target/bio-formats-test-pool-1-thread-7-2024-05-01_01-36-59.log]
   [testng] 01:36:59,989 |-INFO in ch.qos.logback.core.sift.SiftProcessor@7e7a5c8a - End of configuration.
   [testng] [2024-05-01 01:37:00,030] [pool-1-thread-6] Initializing /data/tamjid/006003000.flex: 
   [testng] 01:37:00,030 |-INFO in ch.qos.logback.core.model.processor.AppenderModelHandler - Processing appender named [logfile-pool-1-thread-6]
   [testng] 01:37:00,030 |-INFO in ch.qos.logback.core.model.processor.AppenderModelHandler - About to instantiate appender of type [loci.tests.testng.TimestampedLogFileAppender]
   [testng] 01:37:00,031 |-INFO in loci.tests.testng.TimestampedLogFileAppender[logfile-pool-1-thread-6] - File property is set to [target/bio-formats-test-pool-1-thread-6-2024-05-01_01-37-00.log]
   [testng] 01:37:00,031 |-INFO in ch.qos.logback.core.sift.SiftProcessor@85ea298 - End of configuration.
   [testng] [2024-05-01 01:37:00,059] [pool-1-thread-5] Initializing /data/tony/003008000.flex: 
   [testng] 01:37:00,059 |-INFO in ch.qos.logback.core.model.processor.AppenderModelHandler - Processing appender named [logfile-pool-1-thread-5]
   [testng] 01:37:00,059 |-INFO in ch.qos.logback.core.model.processor.AppenderModelHandler - About to instantiate appender of type [loci.tests.testng.TimestampedLogFileAppender]
   [testng] 01:37:00,060 |-INFO in loci.tests.testng.TimestampedLogFileAppender[logfile-pool-1-thread-5] - File property is set to [target/bio-formats-test-pool-1-thread-5-2024-05-01_01-37-00.log]
   [testng] 01:37:00,060 |-INFO in ch.qos.logback.core.sift.SiftProcessor@551a3e8a - End of configuration.
   [testng] [2024-05-01 01:37:00,107] [pool-1-thread-4] Initializing /data/tamjid/006005000.flex: 
   [testng] 01:37:00,107 |-INFO in ch.qos.logback.core.model.processor.AppenderModelHandler - Processing appender named [logfile-pool-1-thread-4]
   [testng] 01:37:00,107 |-INFO in ch.qos.logback.core.model.processor.AppenderModelHandler - About to instantiate appender of type [loci.tests.testng.TimestampedLogFileAppender]
   [testng] 01:37:00,108 |-INFO in loci.tests.testng.TimestampedLogFileAppender[logfile-pool-1-thread-4] - File property is set to [target/bio-formats-test-pool-1-thread-4-2024-05-01_01-37-00.log]
   [testng] 01:37:00,108 |-INFO in ch.qos.logback.core.sift.SiftProcessor@2a7d87d0 - End of configuration.
   [testng] [2024-05-01 01:37:00,134] [pool-1-thread-3] Initializing /data/qa-2983/004007000.flex: 
   [testng] 01:37:00,134 |-INFO in ch.qos.logback.core.model.processor.AppenderModelHandler - Processing appender named [logfile-pool-1-thread-3]
   [testng] 01:37:00,134 |-INFO in ch.qos.logback.core.model.processor.AppenderModelHandler - About to instantiate appender of type [loci.tests.testng.TimestampedLogFileAppender]
   [testng] 01:37:00,135 |-INFO in loci.tests.testng.TimestampedLogFileAppender[logfile-pool-1-thread-3] - File property is set to [target/bio-formats-test-pool-1-thread-3-2024-05-01_01-37-00.log]
   [testng] 01:37:00,135 |-INFO in ch.qos.logback.core.sift.SiftProcessor@5dc9e566 - End of configuration.
   [testng] [2024-05-01 01:37:00,194] [pool-1-thread-2] Initializing /data/christophe/B5_1 GFP RFP Draq5 20times 7planes step2.flex: 
   [testng] 01:37:00,194 |-INFO in ch.qos.logback.core.model.processor.AppenderModelHandler - Processing appender named [logfile-pool-1-thread-2]
   [testng] 01:37:00,194 |-INFO in ch.qos.logback.core.model.processor.AppenderModelHandler - About to instantiate appender of type [loci.tests.testng.TimestampedLogFileAppender]
   [testng] 01:37:00,194 |-INFO in loci.tests.testng.TimestampedLogFileAppender[logfile-pool-1-thread-2] - File property is set to [target/bio-formats-test-pool-1-thread-2-2024-05-01_01-37-00.log]
   [testng] 01:37:00,195 |-INFO in ch.qos.logback.core.sift.SiftProcessor@44b7b736 - End of configuration.
   [testng] [2024-05-01 01:37:00,832] [pool-1-thread-4] 	testMemoFileUsage: FAILED (Memo file not saved)
   [testng] [2024-05-01 01:37:00,832] [pool-1-thread-4] 
   [testng] java.lang.AssertionError: Memo file not saved
   [testng] 	at loci.tests.testng.FormatReaderTest.result(FormatReaderTest.java:3296)
   [testng] 	at loci.tests.testng.FormatReaderTest.testMemoFileUsage(FormatReaderTest.java:2959)
   [testng] 	at java.base/jdk.internal.reflect.NativeMethodAccessorImpl.invoke0(Native Method)
   [testng] 	at java.base/jdk.internal.reflect.NativeMethodAccessorImpl.invoke(NativeMethodAccessorImpl.java:77)
   [testng] 	at java.base/jdk.internal.reflect.DelegatingMethodAccessorImpl.invoke(DelegatingMethodAccessorImpl.java:43)
   [testng] 	at java.base/java.lang.reflect.Method.invoke(Method.java:568)
   [testng] 	at org.testng.internal.MethodInvocationHelper.invokeMethod(MethodInvocationHelper.java:80)
   [testng] 	at org.testng.internal.Invoker.invokeMethod(Invoker.java:714)
   [testng] 	at org.testng.internal.Invoker.invokeTestMethod(Invoker.java:901)
   [testng] 	at org.testng.internal.Invoker.invokeTestMethods(Invoker.java:1231)
   [testng] 	at org.testng.internal.TestMethodWorker.invokeTestMethods(TestMethodWorker.java:127)
   [testng] 	at org.testng.internal.TestMethodWorker.run(TestMethodWorker.java:111)
   [testng] 	at java.base/java.util.concurrent.ThreadPoolExecutor.runWorker(ThreadPoolExecutor.java:1136)
   [testng] 	at java.base/java.util.concurrent.ThreadPoolExecutor$Worker.run(ThreadPoolExecutor.java:635)
   [testng] 	at java.base/java.lang.Thread.run(Thread.java:833)
   [testng] [2024-05-01 01:37:00,832] [pool-1-thread-4] 	testMemoFileUsage: FAILED (Memo file not saved)
   [testng] [2024-05-01 01:37:00,833] [pool-1-thread-4] memo file size not available
   [testng] [2024-05-01 01:37:00,833] [pool-1-thread-6] 	testMemoFileUsage: FAILED (Memo file not saved)
   [testng] [2024-05-01 01:37:00,833] [pool-1-thread-6] 
   [testng] java.lang.AssertionError: Memo file not saved
   [testng] 	at loci.tests.testng.FormatReaderTest.result(FormatReaderTest.java:3296)
   [testng] 	at loci.tests.testng.FormatReaderTest.testMemoFileUsage(FormatReaderTest.java:2959)
   [testng] 	at java.base/jdk.internal.reflect.NativeMethodAccessorImpl.invoke0(Native Method)
   [testng] 	at java.base/jdk.internal.reflect.NativeMethodAccessorImpl.invoke(NativeMethodAccessorImpl.java:77)
   [testng] 	at java.base/jdk.internal.reflect.DelegatingMethodAccessorImpl.invoke(DelegatingMethodAccessorImpl.java:43)
   [testng] 	at java.base/java.lang.reflect.Method.invoke(Method.java:568)
   [testng] 	at org.testng.internal.MethodInvocationHelper.invokeMethod(MethodInvocationHelper.java:80)
   [testng] 	at org.testng.internal.Invoker.invokeMethod(Invoker.java:714)
   [testng] 	at org.testng.internal.Invoker.invokeTestMethod(Invoker.java:901)
   [testng] 	at org.testng.internal.Invoker.invokeTestMethods(Invoker.java:1231)
   [testng] 	at org.testng.internal.TestMethodWorker.invokeTestMethods(TestMethodWorker.java:127)
   [testng] 	at org.testng.internal.TestMethodWorker.run(TestMethodWorker.java:111)
   [testng] 	at java.base/java.util.concurrent.ThreadPoolExecutor.runWorker(ThreadPoolExecutor.java:1136)
   [testng] 	at java.base/java.util.concurrent.ThreadPoolExecutor$Worker.run(ThreadPoolExecutor.java:635)
   [testng] 	at java.base/java.lang.Thread.run(Thread.java:833)
   [testng] [2024-05-01 01:37:00,833] [pool-1-thread-6] 	testMemoFileUsage: FAILED (Memo file not saved)
   [testng] [2024-05-01 01:37:00,833] [pool-1-thread-6] memo file size not available
   [testng] [2024-05-01 01:37:00,848] [pool-1-thread-10] 	testMemoFileUsage: FAILED (Memo file not saved)
   [testng] [2024-05-01 01:37:00,848] [pool-1-thread-10] 
   [testng] java.lang.AssertionError: Memo file not saved
   [testng] 	at loci.tests.testng.FormatReaderTest.result(FormatReaderTest.java:3296)
   [testng] 	at loci.tests.testng.FormatReaderTest.testMemoFileUsage(FormatReaderTest.java:2959)
   [testng] 	at java.base/jdk.internal.reflect.NativeMethodAccessorImpl.invoke0(Native Method)
   [testng] 	at java.base/jdk.internal.reflect.NativeMethodAccessorImpl.invoke(NativeMethodAccessorImpl.java:77)
   [testng] 	at java.base/jdk.internal.reflect.DelegatingMethodAccessorImpl.invoke(DelegatingMethodAccessorImpl.java:43)
   [testng] 	at java.base/java.lang.reflect.Method.invoke(Method.java:568)
   [testng] 	at org.testng.internal.MethodInvocationHelper.invokeMethod(MethodInvocationHelper.java:80)
   [testng] 	at org.testng.internal.Invoker.invokeMethod(Invoker.java:714)
   [testng] 	at org.testng.internal.Invoker.invokeTestMethod(Invoker.java:901)
   [testng] 	at org.testng.internal.Invoker.invokeTestMethods(Invoker.java:1231)
   [testng] 	at org.testng.internal.TestMethodWorker.invokeTestMethods(TestMethodWorker.java:127)
   [testng] 	at org.testng.internal.TestMethodWorker.run(TestMethodWorker.java:111)
   [testng] 	at java.base/java.util.concurrent.ThreadPoolExecutor.runWorker(ThreadPoolExecutor.java:1136)
   [testng] 	at java.base/java.util.concurrent.ThreadPoolExecutor$Worker.run(ThreadPoolExecutor.java:635)
   [testng] 	at java.base/java.lang.Thread.run(Thread.java:833)
   [testng] [2024-05-01 01:37:00,848] [pool-1-thread-10] 	testMemoFileUsage: FAILED (Memo file not saved)
   [testng] [2024-05-01 01:37:00,848] [pool-1-thread-10] memo file size not available
   [testng] [2024-05-01 01:37:00,860] [pool-1-thread-3] 	testMemoFileUsage: FAILED (Memo file not saved)
   [testng] [2024-05-01 01:37:00,860] [pool-1-thread-3] 
   [testng] java.lang.AssertionError: Memo file not saved
   [testng] 	at loci.tests.testng.FormatReaderTest.result(FormatReaderTest.java:3296)
   [testng] 	at loci.tests.testng.FormatReaderTest.testMemoFileUsage(FormatReaderTest.java:2959)
   [testng] 	at java.base/jdk.internal.reflect.NativeMethodAccessorImpl.invoke0(Native Method)
   [testng] 	at java.base/jdk.internal.reflect.NativeMethodAccessorImpl.invoke(NativeMethodAccessorImpl.java:77)
   [testng] 	at java.base/jdk.internal.reflect.DelegatingMethodAccessorImpl.invoke(DelegatingMethodAccessorImpl.java:43)
   [testng] 	at java.base/java.lang.reflect.Method.invoke(Method.java:568)
   [testng] 	at org.testng.internal.MethodInvocationHelper.invokeMethod(MethodInvocationHelper.java:80)
   [testng] 	at org.testng.internal.Invoker.invokeMethod(Invoker.java:714)
   [testng] 	at org.testng.internal.Invoker.invokeTestMethod(Invoker.java:901)
   [testng] 	at org.testng.internal.Invoker.invokeTestMethods(Invoker.java:1231)
   [testng] 	at org.testng.internal.TestMethodWorker.invokeTestMethods(TestMethodWorker.java:127)
   [testng] 	at org.testng.internal.TestMethodWorker.run(TestMethodWorker.java:111)
   [testng] 	at java.base/java.util.concurrent.ThreadPoolExecutor.runWorker(ThreadPoolExecutor.java:1136)
   [testng] 	at java.base/java.util.concurrent.ThreadPoolExecutor$Worker.run(ThreadPoolExecutor.java:635)
   [testng] 	at java.base/java.lang.Thread.run(Thread.java:833)
   [testng] [2024-05-01 01:37:00,860] [pool-1-thread-3] 	testMemoFileUsage: FAILED (Memo file not saved)
   [testng] [2024-05-01 01:37:00,860] [pool-1-thread-3] memo file size not available
   [testng] [2024-05-01 01:37:00,863] [pool-1-thread-1] 	testMemoFileUsage: FAILED (Memo file not saved)
   [testng] [2024-05-01 01:37:00,863] [pool-1-thread-1] 
   [testng] java.lang.AssertionError: Memo file not saved
   [testng] 	at loci.tests.testng.FormatReaderTest.result(FormatReaderTest.java:3296)
   [testng] 	at loci.tests.testng.FormatReaderTest.testMemoFileUsage(FormatReaderTest.java:2959)
   [testng] 	at java.base/jdk.internal.reflect.NativeMethodAccessorImpl.invoke0(Native Method)
   [testng] 	at java.base/jdk.internal.reflect.NativeMethodAccessorImpl.invoke(NativeMethodAccessorImpl.java:77)
   [testng] 	at java.base/jdk.internal.reflect.DelegatingMethodAccessorImpl.invoke(DelegatingMethodAccessorImpl.java:43)
   [testng] 	at java.base/java.lang.reflect.Method.invoke(Method.java:568)
   [testng] 	at org.testng.internal.MethodInvocationHelper.invokeMethod(MethodInvocationHelper.java:80)
   [testng] 	at org.testng.internal.Invoker.invokeMethod(Invoker.java:714)
   [testng] 	at org.testng.internal.Invoker.invokeTestMethod(Invoker.java:901)
   [testng] 	at org.testng.internal.Invoker.invokeTestMethods(Invoker.java:1231)
   [testng] 	at org.testng.internal.TestMethodWorker.invokeTestMethods(TestMethodWorker.java:127)
   [testng] 	at org.testng.internal.TestMethodWorker.run(TestMethodWorker.java:111)
   [testng] 	at java.base/java.util.concurrent.ThreadPoolExecutor.runWorker(ThreadPoolExecutor.java:1136)
   [testng] 	at java.base/java.util.concurrent.ThreadPoolExecutor$Worker.run(ThreadPoolExecutor.java:635)
   [testng] 	at java.base/java.lang.Thread.run(Thread.java:833)
   [testng] [2024-05-01 01:37:00,864] [pool-1-thread-1] 	testMemoFileUsage: FAILED (Memo file not saved)
   [testng] [2024-05-01 01:37:00,864] [pool-1-thread-1] memo file size not available
   [testng] [2024-05-01 01:37:00,865] [pool-1-thread-12] 	testMemoFileUsage: FAILED (Memo file not saved)
   [testng] [2024-05-01 01:37:00,865] [pool-1-thread-12] 
   [testng] java.lang.AssertionError: Memo file not saved
   [testng] 	at loci.tests.testng.FormatReaderTest.result(FormatReaderTest.java:3296)
   [testng] 	at loci.tests.testng.FormatReaderTest.testMemoFileUsage(FormatReaderTest.java:2959)
   [testng] 	at java.base/jdk.internal.reflect.NativeMethodAccessorImpl.invoke0(Native Method)
   [testng] 	at java.base/jdk.internal.reflect.NativeMethodAccessorImpl.invoke(NativeMethodAccessorImpl.java:77)
   [testng] 	at java.base/jdk.internal.reflect.DelegatingMethodAccessorImpl.invoke(DelegatingMethodAccessorImpl.java:43)
   [testng] 	at java.base/java.lang.reflect.Method.invoke(Method.java:568)
   [testng] 	at org.testng.internal.MethodInvocationHelper.invokeMethod(MethodInvocationHelper.java:80)
   [testng] 	at org.testng.internal.Invoker.invokeMethod(Invoker.java:714)
   [testng] 	at org.testng.internal.Invoker.invokeTestMethod(Invoker.java:901)
   [testng] 	at org.testng.internal.Invoker.invokeTestMethods(Invoker.java:1231)
   [testng] 	at org.testng.internal.TestMethodWorker.invokeTestMethods(TestMethodWorker.java:127)
   [testng] 	at org.testng.internal.TestMethodWorker.run(TestMethodWorker.java:111)
   [testng] 	at java.base/java.util.concurrent.ThreadPoolExecutor.runWorker(ThreadPoolExecutor.java:1136)
   [testng] 	at java.base/java.util.concurrent.ThreadPoolExecutor$Worker.run(ThreadPoolExecutor.java:635)
   [testng] 	at java.base/java.lang.Thread.run(Thread.java:833)
   [testng] [2024-05-01 01:37:00,865] [pool-1-thread-12] 	testMemoFileUsage: FAILED (Memo file not saved)
   [testng] [2024-05-01 01:37:00,865] [pool-1-thread-12] memo file size not available
   [testng] [2024-05-01 01:37:02,111] [pool-1-thread-4] Initializing /data/tony/015002000.tiff: 
   [testng] [2024-05-01 01:37:02,170] [pool-1-thread-10] Initializing /data/qa-17190/002002011.flex: 
   [testng] [2024-05-01 01:37:02,205] [pool-1-thread-6] Initializing /data/karsten/BioFormats_FLEX181_PKI/AFo_071214_measurement3_kinetics_10x/Meas_02(2007-12-14_10-40-56)/004006000.flex: 
   [testng] [2024-05-01 01:37:02,244] [pool-1-thread-7] Initializing /data/tony/001014000 - from flex.tif: 
   [testng] [2024-05-01 01:37:02,294] [pool-1-thread-12] Initializing /data/public/idr0001/X_110331_S13/Meas_05(2011-03-31_14-36-06)/001001000.flex: 
   [testng] [2024-05-01 01:37:02,710] [pool-1-thread-3] Initializing /data/tony/test.tiff: 
   [testng] [2024-05-01 01:37:02,949] [pool-1-thread-10] 	testMemoFileUsage: FAILED (Memo file not saved)
   [testng] [2024-05-01 01:37:02,949] [pool-1-thread-10] 
   [testng] java.lang.AssertionError: Memo file not saved
   [testng] 	at loci.tests.testng.FormatReaderTest.result(FormatReaderTest.java:3296)
   [testng] 	at loci.tests.testng.FormatReaderTest.testMemoFileUsage(FormatReaderTest.java:2959)
   [testng] 	at java.base/jdk.internal.reflect.NativeMethodAccessorImpl.invoke0(Native Method)
   [testng] 	at java.base/jdk.internal.reflect.NativeMethodAccessorImpl.invoke(NativeMethodAccessorImpl.java:77)
   [testng] 	at java.base/jdk.internal.reflect.DelegatingMethodAccessorImpl.invoke(DelegatingMethodAccessorImpl.java:43)
   [testng] 	at java.base/java.lang.reflect.Method.invoke(Method.java:568)
   [testng] 	at org.testng.internal.MethodInvocationHelper.invokeMethod(MethodInvocationHelper.java:80)
   [testng] 	at org.testng.internal.Invoker.invokeMethod(Invoker.java:714)
   [testng] 	at org.testng.internal.Invoker.invokeTestMethod(Invoker.java:901)
   [testng] 	at org.testng.internal.Invoker.invokeTestMethods(Invoker.java:1231)
   [testng] 	at org.testng.internal.TestMethodWorker.invokeTestMethods(TestMethodWorker.java:127)
   [testng] 	at org.testng.internal.TestMethodWorker.run(TestMethodWorker.java:111)
   [testng] 	at java.base/java.util.concurrent.ThreadPoolExecutor.runWorker(ThreadPoolExecutor.java:1136)
   [testng] 	at java.base/java.util.concurrent.ThreadPoolExecutor$Worker.run(ThreadPoolExecutor.java:635)
   [testng] 	at java.base/java.lang.Thread.run(Thread.java:833)
   [testng] [2024-05-01 01:37:02,949] [pool-1-thread-10] 	testMemoFileUsage: FAILED (Memo file not saved)
   [testng] [2024-05-01 01:37:02,949] [pool-1-thread-10] memo file size not available
   [testng] [2024-05-01 01:37:02,975] [pool-1-thread-5] 	testMemoFileUsage: FAILED (Memo file not saved)
   [testng] [2024-05-01 01:37:02,975] [pool-1-thread-5] 
   [testng] java.lang.AssertionError: Memo file not saved
   [testng] 	at loci.tests.testng.FormatReaderTest.result(FormatReaderTest.java:3296)
   [testng] 	at loci.tests.testng.FormatReaderTest.testMemoFileUsage(FormatReaderTest.java:2959)
   [testng] 	at java.base/jdk.internal.reflect.NativeMethodAccessorImpl.invoke0(Native Method)
   [testng] 	at java.base/jdk.internal.reflect.NativeMethodAccessorImpl.invoke(NativeMethodAccessorImpl.java:77)
   [testng] 	at java.base/jdk.internal.reflect.DelegatingMethodAccessorImpl.invoke(DelegatingMethodAccessorImpl.java:43)
   [testng] 	at java.base/java.lang.reflect.Method.invoke(Method.java:568)
   [testng] 	at org.testng.internal.MethodInvocationHelper.invokeMethod(MethodInvocationHelper.java:80)
   [testng] 	at org.testng.internal.Invoker.invokeMethod(Invoker.java:714)
   [testng] 	at org.testng.internal.Invoker.invokeTestMethod(Invoker.java:901)
   [testng] 	at org.testng.internal.Invoker.invokeTestMethods(Invoker.java:1231)
   [testng] 	at org.testng.internal.TestMethodWorker.invokeTestMethods(TestMethodWorker.java:127)
   [testng] 	at org.testng.internal.TestMethodWorker.run(TestMethodWorker.java:111)
   [testng] 	at java.base/java.util.concurrent.ThreadPoolExecutor.runWorker(ThreadPoolExecutor.java:1136)
   [testng] 	at java.base/java.util.concurrent.ThreadPoolExecutor$Worker.run(ThreadPoolExecutor.java:635)
   [testng] 	at java.base/java.lang.Thread.run(Thread.java:833)
   [testng] [2024-05-01 01:37:02,975] [pool-1-thread-5] 	testMemoFileUsage: FAILED (Memo file not saved)
   [testng] [2024-05-01 01:37:02,976] [pool-1-thread-5] memo file size not available
   [testng] [2024-05-01 01:37:03,053] [pool-1-thread-6] 	testMemoFileUsage: FAILED (Memo file not saved)
   [testng] [2024-05-01 01:37:03,053] [pool-1-thread-6] 
   [testng] java.lang.AssertionError: Memo file not saved
   [testng] 	at loci.tests.testng.FormatReaderTest.result(FormatReaderTest.java:3296)
   [testng] 	at loci.tests.testng.FormatReaderTest.testMemoFileUsage(FormatReaderTest.java:2959)
   [testng] 	at java.base/jdk.internal.reflect.NativeMethodAccessorImpl.invoke0(Native Method)
   [testng] 	at java.base/jdk.internal.reflect.NativeMethodAccessorImpl.invoke(NativeMethodAccessorImpl.java:77)
   [testng] 	at java.base/jdk.internal.reflect.DelegatingMethodAccessorImpl.invoke(DelegatingMethodAccessorImpl.java:43)
   [testng] 	at java.base/java.lang.reflect.Method.invoke(Method.java:568)
   [testng] 	at org.testng.internal.MethodInvocationHelper.invokeMethod(MethodInvocationHelper.java:80)
   [testng] 	at org.testng.internal.Invoker.invokeMethod(Invoker.java:714)
   [testng] 	at org.testng.internal.Invoker.invokeTestMethod(Invoker.java:901)
   [testng] 	at org.testng.internal.Invoker.invokeTestMethods(Invoker.java:1231)
   [testng] 	at org.testng.internal.TestMethodWorker.invokeTestMethods(TestMethodWorker.java:127)
   [testng] 	at org.testng.internal.TestMethodWorker.run(TestMethodWorker.java:111)
   [testng] 	at java.base/java.util.concurrent.ThreadPoolExecutor.runWorker(ThreadPoolExecutor.java:1136)
   [testng] 	at java.base/java.util.concurrent.ThreadPoolExecutor$Worker.run(ThreadPoolExecutor.java:635)
   [testng] 	at java.base/java.lang.Thread.run(Thread.java:833)
   [testng] [2024-05-01 01:37:03,053] [pool-1-thread-6] 	testMemoFileUsage: FAILED (Memo file not saved)
   [testng] [2024-05-01 01:37:03,053] [pool-1-thread-6] memo file size not available
   [testng] [2024-05-01 01:37:03,310] [pool-1-thread-1] Initializing /data/achim/003003000.flex: 
   [testng] [2024-05-01 01:37:03,415] [pool-1-thread-10] Initializing /data/stephane/006013000.flex: 
   [testng] [2024-05-01 01:37:03,527] [pool-1-thread-7] Initializing /data/karsten/BioFormats_FLEX181_PKI/AFo_071214_measurement3_kinetics_10x/Meas_05(2007-12-14_11-25-56)/004006000.flex: 
   [testng] [2024-05-01 01:37:03,617] [pool-1-thread-4] Initializing /data/public/idr0001/X_110331_S13/Meas_02(2011-03-31_12-33-53)/001001000.flex: 
   [testng] [2024-05-01 01:37:04,229] [pool-1-thread-1] 	testMemoFileUsage: FAILED (Memo file not saved)
   [testng] [2024-05-01 01:37:04,229] [pool-1-thread-1] 
   [testng] java.lang.AssertionError: Memo file not saved
   [testng] 	at loci.tests.testng.FormatReaderTest.result(FormatReaderTest.java:3296)
   [testng] 	at loci.tests.testng.FormatReaderTest.testMemoFileUsage(FormatReaderTest.java:2959)
   [testng] 	at java.base/jdk.internal.reflect.NativeMethodAccessorImpl.invoke0(Native Method)
   [testng] 	at java.base/jdk.internal.reflect.NativeMethodAccessorImpl.invoke(NativeMethodAccessorImpl.java:77)
   [testng] 	at java.base/jdk.internal.reflect.DelegatingMethodAccessorImpl.invoke(DelegatingMethodAccessorImpl.java:43)
   [testng] 	at java.base/java.lang.reflect.Method.invoke(Method.java:568)
   [testng] 	at org.testng.internal.MethodInvocationHelper.invokeMethod(MethodInvocationHelper.java:80)
   [testng] 	at org.testng.internal.Invoker.invokeMethod(Invoker.java:714)
   [testng] 	at org.testng.internal.Invoker.invokeTestMethod(Invoker.java:901)
   [testng] 	at org.testng.internal.Invoker.invokeTestMethods(Invoker.java:1231)
   [testng] 	at org.testng.internal.TestMethodWorker.invokeTestMethods(TestMethodWorker.java:127)
   [testng] 	at org.testng.internal.TestMethodWorker.run(TestMethodWorker.java:111)
   [testng] 	at java.base/java.util.concurrent.ThreadPoolExecutor.runWorker(ThreadPoolExecutor.java:1136)
   [testng] 	at java.base/java.util.concurrent.ThreadPoolExecutor$Worker.run(ThreadPoolExecutor.java:635)
   [testng] 	at java.base/java.lang.Thread.run(Thread.java:833)
   [testng] [2024-05-01 01:37:04,229] [pool-1-thread-1] 	testMemoFileUsage: FAILED (Memo file not saved)
   [testng] [2024-05-01 01:37:04,229] [pool-1-thread-1] memo file size not available
   [testng] [2024-05-01 01:37:04,231] [pool-1-thread-3] Initializing /data/tony/003003000.tiff: 
   [testng] [2024-05-01 01:37:04,330] [pool-1-thread-6] Initializing /data/karsten/BioFormats_FLEX181_PKI/AFo_071214_measurement3_kinetics_10x/Meas_06(2007-12-14_11-50-57)/004006000.flex: 
   [testng] [2024-05-01 01:37:04,491] [pool-1-thread-7] 	testMemoFileUsage: FAILED (Memo file not saved)
   [testng] [2024-05-01 01:37:04,491] [pool-1-thread-7] 
   [testng] java.lang.AssertionError: Memo file not saved
   [testng] 	at loci.tests.testng.FormatReaderTest.result(FormatReaderTest.java:3296)
   [testng] 	at loci.tests.testng.FormatReaderTest.testMemoFileUsage(FormatReaderTest.java:2959)
   [testng] 	at java.base/jdk.internal.reflect.NativeMethodAccessorImpl.invoke0(Native Method)
   [testng] 	at java.base/jdk.internal.reflect.NativeMethodAccessorImpl.invoke(NativeMethodAccessorImpl.java:77)
   [testng] 	at java.base/jdk.internal.reflect.DelegatingMethodAccessorImpl.invoke(DelegatingMethodAccessorImpl.java:43)
   [testng] 	at java.base/java.lang.reflect.Method.invoke(Method.java:568)
   [testng] 	at org.testng.internal.MethodInvocationHelper.invokeMethod(MethodInvocationHelper.java:80)
   [testng] 	at org.testng.internal.Invoker.invokeMethod(Invoker.java:714)
   [testng] 	at org.testng.internal.Invoker.invokeTestMethod(Invoker.java:901)
   [testng] 	at org.testng.internal.Invoker.invokeTestMethods(Invoker.java:1231)
   [testng] 	at org.testng.internal.TestMethodWorker.invokeTestMethods(TestMethodWorker.java:127)
   [testng] 	at org.testng.internal.TestMethodWorker.run(TestMethodWorker.java:111)
   [testng] 	at java.base/java.util.concurrent.ThreadPoolExecutor.runWorker(ThreadPoolExecutor.java:1136)
   [testng] 	at java.base/java.util.concurrent.ThreadPoolExecutor$Worker.run(ThreadPoolExecutor.java:635)
   [testng] 	at java.base/java.lang.Thread.run(Thread.java:833)
   [testng] [2024-05-01 01:37:04,491] [pool-1-thread-7] 	testMemoFileUsage: FAILED (Memo file not saved)
   [testng] [2024-05-01 01:37:04,492] [pool-1-thread-7] memo file size not available
   [testng] [2024-05-01 01:37:05,036] [pool-1-thread-1] Initializing /data/karsten/BioFormats_FLEX181_PKI/AFo_071213_measurement1_6fields/Meas_01(2007-12-13_17-19-36)/004006000.flex: 
   [testng] [2024-05-01 01:37:05,206] [pool-1-thread-10] 	testMemoFileUsage: FAILED (Memo file not saved)
   [testng] [2024-05-01 01:37:05,206] [pool-1-thread-10] 
   [testng] java.lang.AssertionError: Memo file not saved
   [testng] 	at loci.tests.testng.FormatReaderTest.result(FormatReaderTest.java:3296)
   [testng] 	at loci.tests.testng.FormatReaderTest.testMemoFileUsage(FormatReaderTest.java:2959)
   [testng] 	at jdk.internal.reflect.GeneratedMethodAccessor32.invoke(Unknown Source)
   [testng] 	at java.base/jdk.internal.reflect.DelegatingMethodAccessorImpl.invoke(DelegatingMethodAccessorImpl.java:43)
   [testng] 	at java.base/java.lang.reflect.Method.invoke(Method.java:568)
   [testng] 	at org.testng.internal.MethodInvocationHelper.invokeMethod(MethodInvocationHelper.java:80)
   [testng] 	at org.testng.internal.Invoker.invokeMethod(Invoker.java:714)
   [testng] 	at org.testng.internal.Invoker.invokeTestMethod(Invoker.java:901)
   [testng] 	at org.testng.internal.Invoker.invokeTestMethods(Invoker.java:1231)
   [testng] 	at org.testng.internal.TestMethodWorker.invokeTestMethods(TestMethodWorker.java:127)
   [testng] 	at org.testng.internal.TestMethodWorker.run(TestMethodWorker.java:111)
   [testng] 	at java.base/java.util.concurrent.ThreadPoolExecutor.runWorker(ThreadPoolExecutor.java:1136)
   [testng] 	at java.base/java.util.concurrent.ThreadPoolExecutor$Worker.run(ThreadPoolExecutor.java:635)
   [testng] 	at java.base/java.lang.Thread.run(Thread.java:833)
   [testng] [2024-05-01 01:37:05,206] [pool-1-thread-10] 	testMemoFileUsage: FAILED (Memo file not saved)
   [testng] [2024-05-01 01:37:05,206] [pool-1-thread-10] memo file size not available
   [testng] [2024-05-01 01:37:05,231] [pool-1-thread-5] Initializing /data/public/idr0001/X_110331_S13/Meas_06(2011-03-31_15-16-53)/001001000.flex: 
   [testng] [2024-05-01 01:37:05,724] [pool-1-thread-7] Initializing /data/karsten/BioFormats_FLEX181_PKI/AFo_071214_measurement3_kinetics_10x/Meas_03(2007-12-14_10-50-56)/004006000.flex: 
   [testng] [2024-05-01 01:37:05,789] [pool-1-thread-11] 	testMemoFileUsage: FAILED (Memo file not saved)
   [testng] [2024-05-01 01:37:05,789] [pool-1-thread-11] 
   [testng] java.lang.AssertionError: Memo file not saved
   [testng] 	at loci.tests.testng.FormatReaderTest.result(FormatReaderTest.java:3296)
   [testng] 	at loci.tests.testng.FormatReaderTest.testMemoFileUsage(FormatReaderTest.java:2959)
   [testng] 	at jdk.internal.reflect.GeneratedMethodAccessor32.invoke(Unknown Source)
   [testng] 	at java.base/jdk.internal.reflect.DelegatingMethodAccessorImpl.invoke(DelegatingMethodAccessorImpl.java:43)
   [testng] 	at java.base/java.lang.reflect.Method.invoke(Method.java:568)
   [testng] 	at org.testng.internal.MethodInvocationHelper.invokeMethod(MethodInvocationHelper.java:80)
   [testng] 	at org.testng.internal.Invoker.invokeMethod(Invoker.java:714)
   [testng] 	at org.testng.internal.Invoker.invokeTestMethod(Invoker.java:901)
   [testng] 	at org.testng.internal.Invoker.invokeTestMethods(Invoker.java:1231)
   [testng] 	at org.testng.internal.TestMethodWorker.invokeTestMethods(TestMethodWorker.java:127)
   [testng] 	at org.testng.internal.TestMethodWorker.run(TestMethodWorker.java:111)
   [testng] 	at java.base/java.util.concurrent.ThreadPoolExecutor.runWorker(ThreadPoolExecutor.java:1136)
   [testng] 	at java.base/java.util.concurrent.ThreadPoolExecutor$Worker.run(ThreadPoolExecutor.java:635)
   [testng] 	at java.base/java.lang.Thread.run(Thread.java:833)
   [testng] [2024-05-01 01:37:05,789] [pool-1-thread-11] 	testMemoFileUsage: FAILED (Memo file not saved)
   [testng] [2024-05-01 01:37:05,789] [pool-1-thread-11] memo file size not available
   [testng] [2024-05-01 01:37:05,914] [pool-1-thread-3] Initializing /data/ghislain/test.flex: 
   [testng] [2024-05-01 01:37:06,172] [pool-1-thread-3] 	testMemoFileUsage: FAILED (Memo file not saved)
   [testng] [2024-05-01 01:37:06,172] [pool-1-thread-3] 
   [testng] java.lang.AssertionError: Memo file not saved
   [testng] 	at loci.tests.testng.FormatReaderTest.result(FormatReaderTest.java:3296)
   [testng] 	at loci.tests.testng.FormatReaderTest.testMemoFileUsage(FormatReaderTest.java:2959)
   [testng] 	at jdk.internal.reflect.GeneratedMethodAccessor32.invoke(Unknown Source)
   [testng] 	at java.base/jdk.internal.reflect.DelegatingMethodAccessorImpl.invoke(DelegatingMethodAccessorImpl.java:43)
   [testng] 	at java.base/java.lang.reflect.Method.invoke(Method.java:568)
   [testng] 	at org.testng.internal.MethodInvocationHelper.invokeMethod(MethodInvocationHelper.java:80)
   [testng] 	at org.testng.internal.Invoker.invokeMethod(Invoker.java:714)
   [testng] 	at org.testng.internal.Invoker.invokeTestMethod(Invoker.java:901)
   [testng] 	at org.testng.internal.Invoker.invokeTestMethods(Invoker.java:1231)
   [testng] 	at org.testng.internal.TestMethodWorker.invokeTestMethods(TestMethodWorker.java:127)
   [testng] 	at org.testng.internal.TestMethodWorker.run(TestMethodWorker.java:111)
   [testng] 	at java.base/java.util.concurrent.ThreadPoolExecutor.runWorker(ThreadPoolExecutor.java:1136)
   [testng] 	at java.base/java.util.concurrent.ThreadPoolExecutor$Worker.run(ThreadPoolExecutor.java:635)
   [testng] 	at java.base/java.lang.Thread.run(Thread.java:833)
   [testng] [2024-05-01 01:37:06,172] [pool-1-thread-3] 	testMemoFileUsage: FAILED (Memo file not saved)
   [testng] [2024-05-01 01:37:06,172] [pool-1-thread-3] memo file size not available
   [testng] [2024-05-01 01:37:06,276] [pool-1-thread-7] 	testMemoFileUsage: FAILED (Memo file not saved)
   [testng] [2024-05-01 01:37:06,276] [pool-1-thread-7] 
   [testng] java.lang.AssertionError: Memo file not saved
   [testng] 	at loci.tests.testng.FormatReaderTest.result(FormatReaderTest.java:3296)
   [testng] 	at loci.tests.testng.FormatReaderTest.testMemoFileUsage(FormatReaderTest.java:2959)
   [testng] 	at jdk.internal.reflect.GeneratedMethodAccessor32.invoke(Unknown Source)
   [testng] 	at java.base/jdk.internal.reflect.DelegatingMethodAccessorImpl.invoke(DelegatingMethodAccessorImpl.java:43)
   [testng] 	at java.base/java.lang.reflect.Method.invoke(Method.java:568)
   [testng] 	at org.testng.internal.MethodInvocationHelper.invokeMethod(MethodInvocationHelper.java:80)
   [testng] 	at org.testng.internal.Invoker.invokeMethod(Invoker.java:714)
   [testng] 	at org.testng.internal.Invoker.invokeTestMethod(Invoker.java:901)
   [testng] 	at org.testng.internal.Invoker.invokeTestMethods(Invoker.java:1231)
   [testng] 	at org.testng.internal.TestMethodWorker.invokeTestMethods(TestMethodWorker.java:127)
   [testng] 	at org.testng.internal.TestMethodWorker.run(TestMethodWorker.java:111)
   [testng] 	at java.base/java.util.concurrent.ThreadPoolExecutor.runWorker(ThreadPoolExecutor.java:1136)
   [testng] 	at java.base/java.util.concurrent.ThreadPoolExecutor$Worker.run(ThreadPoolExecutor.java:635)
   [testng] 	at java.base/java.lang.Thread.run(Thread.java:833)
   [testng] [2024-05-01 01:37:06,276] [pool-1-thread-7] 	testMemoFileUsage: FAILED (Memo file not saved)
   [testng] [2024-05-01 01:37:06,276] [pool-1-thread-7] memo file size not available
   [testng] [2024-05-01 01:37:06,627] [pool-1-thread-6] 	testMemoFileUsage: FAILED (Memo file not saved)
   [testng] [2024-05-01 01:37:06,627] [pool-1-thread-6] 
   [testng] java.lang.AssertionError: Memo file not saved
   [testng] 	at loci.tests.testng.FormatReaderTest.result(FormatReaderTest.java:3296)
   [testng] 	at loci.tests.testng.FormatReaderTest.testMemoFileUsage(FormatReaderTest.java:2959)
   [testng] 	at jdk.internal.reflect.GeneratedMethodAccessor32.invoke(Unknown Source)
   [testng] 	at java.base/jdk.internal.reflect.DelegatingMethodAccessorImpl.invoke(DelegatingMethodAccessorImpl.java:43)
   [testng] 	at java.base/java.lang.reflect.Method.invoke(Method.java:568)
   [testng] 	at org.testng.internal.MethodInvocationHelper.invokeMethod(MethodInvocationHelper.java:80)
   [testng] 	at org.testng.internal.Invoker.invokeMethod(Invoker.java:714)
   [testng] 	at org.testng.internal.Invoker.invokeTestMethod(Invoker.java:901)
   [testng] 	at org.testng.internal.Invoker.invokeTestMethods(Invoker.java:1231)
   [testng] 	at org.testng.internal.TestMethodWorker.invokeTestMethods(TestMethodWorker.java:127)
   [testng] 	at org.testng.internal.TestMethodWorker.run(TestMethodWorker.java:111)
   [testng] 	at java.base/java.util.concurrent.ThreadPoolExecutor.runWorker(ThreadPoolExecutor.java:1136)
   [testng] 	at java.base/java.util.concurrent.ThreadPoolExecutor$Worker.run(ThreadPoolExecutor.java:635)
   [testng] 	at java.base/java.lang.Thread.run(Thread.java:833)
   [testng] [2024-05-01 01:37:06,627] [pool-1-thread-6] 	testMemoFileUsage: FAILED (Memo file not saved)
   [testng] [2024-05-01 01:37:06,627] [pool-1-thread-6] memo file size not available
   [testng] [2024-05-01 01:37:06,654] [pool-1-thread-3] Initializing /data/tamjid/006004000.flex: 
   [testng] [2024-05-01 01:37:06,834] [pool-1-thread-3] 	testMemoFileUsage: FAILED (Memo file not saved)
   [testng] [2024-05-01 01:37:06,834] [pool-1-thread-3] 
   [testng] java.lang.AssertionError: Memo file not saved
   [testng] 	at loci.tests.testng.FormatReaderTest.result(FormatReaderTest.java:3296)
   [testng] 	at loci.tests.testng.FormatReaderTest.testMemoFileUsage(FormatReaderTest.java:2959)
   [testng] 	at jdk.internal.reflect.GeneratedMethodAccessor32.invoke(Unknown Source)
   [testng] 	at java.base/jdk.internal.reflect.DelegatingMethodAccessorImpl.invoke(DelegatingMethodAccessorImpl.java:43)
   [testng] 	at java.base/java.lang.reflect.Method.invoke(Method.java:568)
   [testng] 	at org.testng.internal.MethodInvocationHelper.invokeMethod(MethodInvocationHelper.java:80)
   [testng] 	at org.testng.internal.Invoker.invokeMethod(Invoker.java:714)
   [testng] 	at org.testng.internal.Invoker.invokeTestMethod(Invoker.java:901)
   [testng] 	at org.testng.internal.Invoker.invokeTestMethods(Invoker.java:1231)
   [testng] 	at org.testng.internal.TestMethodWorker.invokeTestMethods(TestMethodWorker.java:127)
   [testng] 	at org.testng.internal.TestMethodWorker.run(TestMethodWorker.java:111)
   [testng] 	at java.base/java.util.concurrent.ThreadPoolExecutor.runWorker(ThreadPoolExecutor.java:1136)
   [testng] 	at java.base/java.util.concurrent.ThreadPoolExecutor$Worker.run(ThreadPoolExecutor.java:635)
   [testng] 	at java.base/java.lang.Thread.run(Thread.java:833)
   [testng] [2024-05-01 01:37:06,834] [pool-1-thread-3] 	testMemoFileUsage: FAILED (Memo file not saved)
   [testng] [2024-05-01 01:37:06,834] [pool-1-thread-3] memo file size not available
   [testng] [2024-05-01 01:37:06,978] [pool-1-thread-7] Initializing /data/public/idr0001/X_110331_S13/Meas_01(2011-03-31_11-53-03)/001001000.flex: 
   [testng] [2024-05-01 01:37:07,610] [pool-1-thread-3] Initializing /data/tony/test1.flex: 
   [testng] [2024-05-01 01:37:07,731] [pool-1-thread-3] 	testMemoFileUsage: FAILED (Memo file not saved)
   [testng] [2024-05-01 01:37:07,731] [pool-1-thread-3] 
   [testng] java.lang.AssertionError: Memo file not saved
   [testng] 	at loci.tests.testng.FormatReaderTest.result(FormatReaderTest.java:3296)
   [testng] 	at loci.tests.testng.FormatReaderTest.testMemoFileUsage(FormatReaderTest.java:2959)
   [testng] 	at jdk.internal.reflect.GeneratedMethodAccessor32.invoke(Unknown Source)
   [testng] 	at java.base/jdk.internal.reflect.DelegatingMethodAccessorImpl.invoke(DelegatingMethodAccessorImpl.java:43)
   [testng] 	at java.base/java.lang.reflect.Method.invoke(Method.java:568)
   [testng] 	at org.testng.internal.MethodInvocationHelper.invokeMethod(MethodInvocationHelper.java:80)
   [testng] 	at org.testng.internal.Invoker.invokeMethod(Invoker.java:714)
   [testng] 	at org.testng.internal.Invoker.invokeTestMethod(Invoker.java:901)
   [testng] 	at org.testng.internal.Invoker.invokeTestMethods(Invoker.java:1231)
   [testng] 	at org.testng.internal.TestMethodWorker.invokeTestMethods(TestMethodWorker.java:127)
   [testng] 	at org.testng.internal.TestMethodWorker.run(TestMethodWorker.java:111)
   [testng] 	at java.base/java.util.concurrent.ThreadPoolExecutor.runWorker(ThreadPoolExecutor.java:1136)
   [testng] 	at java.base/java.util.concurrent.ThreadPoolExecutor$Worker.run(ThreadPoolExecutor.java:635)
   [testng] 	at java.base/java.lang.Thread.run(Thread.java:833)
   [testng] [2024-05-01 01:37:07,731] [pool-1-thread-3] 	testMemoFileUsage: FAILED (Memo file not saved)
   [testng] [2024-05-01 01:37:07,731] [pool-1-thread-3] memo file size not available
   [testng] [2024-05-01 01:37:07,952] [pool-1-thread-3] Initializing /data/karsten/BioFormats_FLEX181_PKI/AFo_071214_measurement3_kinetics_10x/Meas_07(2007-12-14_12-20-57)/004006000.flex: 
   [testng] [2024-05-01 01:37:08,100] [pool-1-thread-11] Initializing /data/karsten/BioFormats_FLEX181_PKI/AFo_071214_measurement3_kinetics_10x/Meas_08(2007-12-14_12-55-57)/004006000.flex: 
   [testng] [2024-05-01 01:37:08,124] [pool-1-thread-1] 	testMemoFileUsage: FAILED (Memo file not saved)
   [testng] [2024-05-01 01:37:08,124] [pool-1-thread-1] 
   [testng] java.lang.AssertionError: Memo file not saved
   [testng] 	at loci.tests.testng.FormatReaderTest.result(FormatReaderTest.java:3296)
   [testng] 	at loci.tests.testng.FormatReaderTest.testMemoFileUsage(FormatReaderTest.java:2959)
   [testng] 	at jdk.internal.reflect.GeneratedMethodAccessor32.invoke(Unknown Source)
   [testng] 	at java.base/jdk.internal.reflect.DelegatingMethodAccessorImpl.invoke(DelegatingMethodAccessorImpl.java:43)
   [testng] 	at java.base/java.lang.reflect.Method.invoke(Method.java:568)
   [testng] 	at org.testng.internal.MethodInvocationHelper.invokeMethod(MethodInvocationHelper.java:80)
   [testng] 	at org.testng.internal.Invoker.invokeMethod(Invoker.java:714)
   [testng] 	at org.testng.internal.Invoker.invokeTestMethod(Invoker.java:901)
   [testng] 	at org.testng.internal.Invoker.invokeTestMethods(Invoker.java:1231)
   [testng] 	at org.testng.internal.TestMethodWorker.invokeTestMethods(TestMethodWorker.java:127)
   [testng] 	at org.testng.internal.TestMethodWorker.run(TestMethodWorker.java:111)
   [testng] 	at java.base/java.util.concurrent.ThreadPoolExecutor.runWorker(ThreadPoolExecutor.java:1136)
   [testng] 	at java.base/java.util.concurrent.ThreadPoolExecutor$Worker.run(ThreadPoolExecutor.java:635)
   [testng] 	at java.base/java.lang.Thread.run(Thread.java:833)
   [testng] [2024-05-01 01:37:08,124] [pool-1-thread-1] 	testMemoFileUsage: FAILED (Memo file not saved)
   [testng] [2024-05-01 01:37:08,124] [pool-1-thread-1] memo file size not available
   [testng] [2024-05-01 01:37:08,263] [pool-1-thread-10] Initializing /data/anatole/Meas_05(2012-05-16_18-51-33)/001009001.flex: 
   [testng] [2024-05-01 01:37:08,565] [pool-1-thread-3] 	testMemoFileUsage: FAILED (Memo file not saved)
   [testng] [2024-05-01 01:37:08,565] [pool-1-thread-3] 
   [testng] java.lang.AssertionError: Memo file not saved
   [testng] 	at loci.tests.testng.FormatReaderTest.result(FormatReaderTest.java:3296)
   [testng] 	at loci.tests.testng.FormatReaderTest.testMemoFileUsage(FormatReaderTest.java:2959)
   [testng] 	at jdk.internal.reflect.GeneratedMethodAccessor32.invoke(Unknown Source)
   [testng] 	at java.base/jdk.internal.reflect.DelegatingMethodAccessorImpl.invoke(DelegatingMethodAccessorImpl.java:43)
   [testng] 	at java.base/java.lang.reflect.Method.invoke(Method.java:568)
   [testng] 	at org.testng.internal.MethodInvocationHelper.invokeMethod(MethodInvocationHelper.java:80)
   [testng] 	at org.testng.internal.Invoker.invokeMethod(Invoker.java:714)
   [testng] 	at org.testng.internal.Invoker.invokeTestMethod(Invoker.java:901)
   [testng] 	at org.testng.internal.Invoker.invokeTestMethods(Invoker.java:1231)
   [testng] 	at org.testng.internal.TestMethodWorker.invokeTestMethods(TestMethodWorker.java:127)
   [testng] 	at org.testng.internal.TestMethodWorker.run(TestMethodWorker.java:111)
   [testng] 	at java.base/java.util.concurrent.ThreadPoolExecutor.runWorker(ThreadPoolExecutor.java:1136)
   [testng] 	at java.base/java.util.concurrent.ThreadPoolExecutor$Worker.run(ThreadPoolExecutor.java:635)
   [testng] 	at java.base/java.lang.Thread.run(Thread.java:833)
   [testng] [2024-05-01 01:37:08,565] [pool-1-thread-3] 	testMemoFileUsage: FAILED (Memo file not saved)
   [testng] [2024-05-01 01:37:08,565] [pool-1-thread-3] memo file size not available
   [testng] [2024-05-01 01:37:08,652] [pool-1-thread-11] 	testMemoFileUsage: FAILED (Memo file not saved)
   [testng] [2024-05-01 01:37:08,652] [pool-1-thread-11] 
   [testng] java.lang.AssertionError: Memo file not saved
   [testng] 	at loci.tests.testng.FormatReaderTest.result(FormatReaderTest.java:3296)
   [testng] 	at loci.tests.testng.FormatReaderTest.testMemoFileUsage(FormatReaderTest.java:2959)
   [testng] 	at jdk.internal.reflect.GeneratedMethodAccessor32.invoke(Unknown Source)
   [testng] 	at java.base/jdk.internal.reflect.DelegatingMethodAccessorImpl.invoke(DelegatingMethodAccessorImpl.java:43)
   [testng] 	at java.base/java.lang.reflect.Method.invoke(Method.java:568)
   [testng] 	at org.testng.internal.MethodInvocationHelper.invokeMethod(MethodInvocationHelper.java:80)
   [testng] 	at org.testng.internal.Invoker.invokeMethod(Invoker.java:714)
   [testng] 	at org.testng.internal.Invoker.invokeTestMethod(Invoker.java:901)
   [testng] 	at org.testng.internal.Invoker.invokeTestMethods(Invoker.java:1231)
   [testng] 	at org.testng.internal.TestMethodWorker.invokeTestMethods(TestMethodWorker.java:127)
   [testng] 	at org.testng.internal.TestMethodWorker.run(TestMethodWorker.java:111)
   [testng] 	at java.base/java.util.concurrent.ThreadPoolExecutor.runWorker(ThreadPoolExecutor.java:1136)
   [testng] 	at java.base/java.util.concurrent.ThreadPoolExecutor$Worker.run(ThreadPoolExecutor.java:635)
   [testng] 	at java.base/java.lang.Thread.run(Thread.java:833)
   [testng] [2024-05-01 01:37:08,652] [pool-1-thread-11] 	testMemoFileUsage: FAILED (Memo file not saved)
   [testng] [2024-05-01 01:37:08,653] [pool-1-thread-11] memo file size not available
   [testng] [2024-05-01 01:37:09,225] [pool-1-thread-3] Initializing /data/karsten/BioFormats_FLEX181_PKI/AFo_071213_measurement2_stack/Meas_01(2007-12-13_17-49-27)/004006000.flex: 
   [testng] [2024-05-01 01:37:09,307] [pool-1-thread-6] Initializing /data/karsten/BioFormats_FLEX181_PKI/AFo_071214_measurement3_kinetics_10x/Meas_04(2007-12-14_11-05-56)/004006000.flex: 
   [testng] [2024-05-01 01:37:09,431] [pool-1-thread-11] Initializing /data/public/idr0007/Plate1/001001000.flex: 
   [testng] [2024-05-01 01:37:09,935] [pool-1-thread-6] 	testMemoFileUsage: FAILED (Memo file not saved)
   [testng] [2024-05-01 01:37:09,935] [pool-1-thread-6] 
   [testng] java.lang.AssertionError: Memo file not saved
   [testng] 	at loci.tests.testng.FormatReaderTest.result(FormatReaderTest.java:3296)
   [testng] 	at loci.tests.testng.FormatReaderTest.testMemoFileUsage(FormatReaderTest.java:2959)
   [testng] 	at jdk.internal.reflect.GeneratedMethodAccessor32.invoke(Unknown Source)
   [testng] 	at java.base/jdk.internal.reflect.DelegatingMethodAccessorImpl.invoke(DelegatingMethodAccessorImpl.java:43)
   [testng] 	at java.base/java.lang.reflect.Method.invoke(Method.java:568)
   [testng] 	at org.testng.internal.MethodInvocationHelper.invokeMethod(MethodInvocationHelper.java:80)
   [testng] 	at org.testng.internal.Invoker.invokeMethod(Invoker.java:714)
   [testng] 	at org.testng.internal.Invoker.invokeTestMethod(Invoker.java:901)
   [testng] 	at org.testng.internal.Invoker.invokeTestMethods(Invoker.java:1231)
   [testng] 	at org.testng.internal.TestMethodWorker.invokeTestMethods(TestMethodWorker.java:127)
   [testng] 	at org.testng.internal.TestMethodWorker.run(TestMethodWorker.java:111)
   [testng] 	at java.base/java.util.concurrent.ThreadPoolExecutor.runWorker(ThreadPoolExecutor.java:1136)
   [testng] 	at java.base/java.util.concurrent.ThreadPoolExecutor$Worker.run(ThreadPoolExecutor.java:635)
   [testng] 	at java.base/java.lang.Thread.run(Thread.java:833)
   [testng] [2024-05-01 01:37:09,935] [pool-1-thread-6] 	testMemoFileUsage: FAILED (Memo file not saved)
   [testng] [2024-05-01 01:37:09,935] [pool-1-thread-6] memo file size not available
   [testng] [2024-05-01 01:37:10,622] [pool-1-thread-6] Initializing /data/karsten/BioFormats_FLEX181_PKI/AFo_071214_measurement3_kinetics_10x/Meas_01(2007-12-14_10-35-55)/004006000.flex: 
   [testng] [2024-05-01 01:37:11,238] [pool-1-thread-6] 	testMemoFileUsage: FAILED (Memo file not saved)
   [testng] [2024-05-01 01:37:11,238] [pool-1-thread-6] 
   [testng] java.lang.AssertionError: Memo file not saved
   [testng] 	at loci.tests.testng.FormatReaderTest.result(FormatReaderTest.java:3296)
   [testng] 	at loci.tests.testng.FormatReaderTest.testMemoFileUsage(FormatReaderTest.java:2959)
   [testng] 	at jdk.internal.reflect.GeneratedMethodAccessor32.invoke(Unknown Source)
   [testng] 	at java.base/jdk.internal.reflect.DelegatingMethodAccessorImpl.invoke(DelegatingMethodAccessorImpl.java:43)
   [testng] 	at java.base/java.lang.reflect.Method.invoke(Method.java:568)
   [testng] 	at org.testng.internal.MethodInvocationHelper.invokeMethod(MethodInvocationHelper.java:80)
   [testng] 	at org.testng.internal.Invoker.invokeMethod(Invoker.java:714)
   [testng] 	at org.testng.internal.Invoker.invokeTestMethod(Invoker.java:901)
   [testng] 	at org.testng.internal.Invoker.invokeTestMethods(Invoker.java:1231)
   [testng] 	at org.testng.internal.TestMethodWorker.invokeTestMethods(TestMethodWorker.java:127)
   [testng] 	at org.testng.internal.TestMethodWorker.run(TestMethodWorker.java:111)
   [testng] 	at java.base/java.util.concurrent.ThreadPoolExecutor.runWorker(ThreadPoolExecutor.java:1136)
   [testng] 	at java.base/java.util.concurrent.ThreadPoolExecutor$Worker.run(ThreadPoolExecutor.java:635)
   [testng] 	at java.base/java.lang.Thread.run(Thread.java:833)
   [testng] [2024-05-01 01:37:11,238] [pool-1-thread-6] 	testMemoFileUsage: FAILED (Memo file not saved)
   [testng] [2024-05-01 01:37:11,238] [pool-1-thread-6] memo file size not available
   [testng] [2024-05-01 01:37:11,936] [pool-1-thread-6] Initializing /data/manuel/003003001.flex: 
   [testng] [2024-05-01 01:37:12,084] [pool-1-thread-1] Initializing /data/tony/001001000_objects.flex: 
   [testng] [2024-05-01 01:37:12,090] [pool-1-thread-3] 	testMemoFileUsage: FAILED (Memo file not saved)
   [testng] [2024-05-01 01:37:12,090] [pool-1-thread-3] 
   [testng] java.lang.AssertionError: Memo file not saved
   [testng] 	at loci.tests.testng.FormatReaderTest.result(FormatReaderTest.java:3296)
   [testng] 	at loci.tests.testng.FormatReaderTest.testMemoFileUsage(FormatReaderTest.java:2959)
   [testng] 	at jdk.internal.reflect.GeneratedMethodAccessor32.invoke(Unknown Source)
   [testng] 	at java.base/jdk.internal.reflect.DelegatingMethodAccessorImpl.invoke(DelegatingMethodAccessorImpl.java:43)
   [testng] 	at java.base/java.lang.reflect.Method.invoke(Method.java:568)
   [testng] 	at org.testng.internal.MethodInvocationHelper.invokeMethod(MethodInvocationHelper.java:80)
   [testng] 	at org.testng.internal.Invoker.invokeMethod(Invoker.java:714)
   [testng] 	at org.testng.internal.Invoker.invokeTestMethod(Invoker.java:901)
   [testng] 	at org.testng.internal.Invoker.invokeTestMethods(Invoker.java:1231)
   [testng] 	at org.testng.internal.TestMethodWorker.invokeTestMethods(TestMethodWorker.java:127)
   [testng] 	at org.testng.internal.TestMethodWorker.run(TestMethodWorker.java:111)
   [testng] 	at java.base/java.util.concurrent.ThreadPoolExecutor.runWorker(ThreadPoolExecutor.java:1136)
   [testng] 	at java.base/java.util.concurrent.ThreadPoolExecutor$Worker.run(ThreadPoolExecutor.java:635)
   [testng] 	at java.base/java.lang.Thread.run(Thread.java:833)
   [testng] [2024-05-01 01:37:12,090] [pool-1-thread-3] 	testMemoFileUsage: FAILED (Memo file not saved)
   [testng] [2024-05-01 01:37:12,090] [pool-1-thread-3] memo file size not available
   [testng] [2024-05-01 01:37:12,258] [pool-1-thread-1] 	testMemoFileUsage: FAILED (Memo file not saved)
   [testng] [2024-05-01 01:37:12,258] [pool-1-thread-1] 
   [testng] java.lang.AssertionError: Memo file not saved
   [testng] 	at loci.tests.testng.FormatReaderTest.result(FormatReaderTest.java:3296)
   [testng] 	at loci.tests.testng.FormatReaderTest.testMemoFileUsage(FormatReaderTest.java:2959)
   [testng] 	at jdk.internal.reflect.GeneratedMethodAccessor32.invoke(Unknown Source)
   [testng] 	at java.base/jdk.internal.reflect.DelegatingMethodAccessorImpl.invoke(DelegatingMethodAccessorImpl.java:43)
   [testng] 	at java.base/java.lang.reflect.Method.invoke(Method.java:568)
   [testng] 	at org.testng.internal.MethodInvocationHelper.invokeMethod(MethodInvocationHelper.java:80)
   [testng] 	at org.testng.internal.Invoker.invokeMethod(Invoker.java:714)
   [testng] 	at org.testng.internal.Invoker.invokeTestMethod(Invoker.java:901)
   [testng] 	at org.testng.internal.Invoker.invokeTestMethods(Invoker.java:1231)
   [testng] 	at org.testng.internal.TestMethodWorker.invokeTestMethods(TestMethodWorker.java:127)
   [testng] 	at org.testng.internal.TestMethodWorker.run(TestMethodWorker.java:111)
   [testng] 	at java.base/java.util.concurrent.ThreadPoolExecutor.runWorker(ThreadPoolExecutor.java:1136)
   [testng] 	at java.base/java.util.concurrent.ThreadPoolExecutor$Worker.run(ThreadPoolExecutor.java:635)
   [testng] 	at java.base/java.lang.Thread.run(Thread.java:833)
   [testng] [2024-05-01 01:37:12,259] [pool-1-thread-1] 	testMemoFileUsage: FAILED (Memo file not saved)
   [testng] [2024-05-01 01:37:12,259] [pool-1-thread-1] memo file size not available
   [testng] [2024-05-01 01:37:12,636] [pool-1-thread-1] Initializing /data/qa-18096/002003001.flex: 
   [testng] [2024-05-01 01:37:12,873] [pool-1-thread-6] 	testMemoFileUsage: FAILED (Memo file not saved)
   [testng] [2024-05-01 01:37:12,873] [pool-1-thread-6] 
   [testng] java.lang.AssertionError: Memo file not saved
   [testng] 	at loci.tests.testng.FormatReaderTest.result(FormatReaderTest.java:3296)
   [testng] 	at loci.tests.testng.FormatReaderTest.testMemoFileUsage(FormatReaderTest.java:2959)
   [testng] 	at jdk.internal.reflect.GeneratedMethodAccessor32.invoke(Unknown Source)
   [testng] 	at java.base/jdk.internal.reflect.DelegatingMethodAccessorImpl.invoke(DelegatingMethodAccessorImpl.java:43)
   [testng] 	at java.base/java.lang.reflect.Method.invoke(Method.java:568)
   [testng] 	at org.testng.internal.MethodInvocationHelper.invokeMethod(MethodInvocationHelper.java:80)
   [testng] 	at org.testng.internal.Invoker.invokeMethod(Invoker.java:714)
   [testng] 	at org.testng.internal.Invoker.invokeTestMethod(Invoker.java:901)
   [testng] 	at org.testng.internal.Invoker.invokeTestMethods(Invoker.java:1231)
   [testng] 	at org.testng.internal.TestMethodWorker.invokeTestMethods(TestMethodWorker.java:127)
   [testng] 	at org.testng.internal.TestMethodWorker.run(TestMethodWorker.java:111)
   [testng] 	at java.base/java.util.concurrent.ThreadPoolExecutor.runWorker(ThreadPoolExecutor.java:1136)
   [testng] 	at java.base/java.util.concurrent.ThreadPoolExecutor$Worker.run(ThreadPoolExecutor.java:635)
   [testng] 	at java.base/java.lang.Thread.run(Thread.java:833)
   [testng] [2024-05-01 01:37:12,873] [pool-1-thread-6] 	testMemoFileUsage: FAILED (Memo file not saved)
   [testng] [2024-05-01 01:37:12,873] [pool-1-thread-6] memo file size not available
   [testng] [2024-05-01 01:37:12,877] [pool-1-thread-1] 	testMemoFileUsage: FAILED (Memo file not saved)
   [testng] [2024-05-01 01:37:12,878] [pool-1-thread-1] 
   [testng] java.lang.AssertionError: Memo file not saved
   [testng] 	at loci.tests.testng.FormatReaderTest.result(FormatReaderTest.java:3296)
   [testng] 	at loci.tests.testng.FormatReaderTest.testMemoFileUsage(FormatReaderTest.java:2959)
   [testng] 	at jdk.internal.reflect.GeneratedMethodAccessor32.invoke(Unknown Source)
   [testng] 	at java.base/jdk.internal.reflect.DelegatingMethodAccessorImpl.invoke(DelegatingMethodAccessorImpl.java:43)
   [testng] 	at java.base/java.lang.reflect.Method.invoke(Method.java:568)
   [testng] 	at org.testng.internal.MethodInvocationHelper.invokeMethod(MethodInvocationHelper.java:80)
   [testng] 	at org.testng.internal.Invoker.invokeMethod(Invoker.java:714)
   [testng] 	at org.testng.internal.Invoker.invokeTestMethod(Invoker.java:901)
   [testng] 	at org.testng.internal.Invoker.invokeTestMethods(Invoker.java:1231)
   [testng] 	at org.testng.internal.TestMethodWorker.invokeTestMethods(TestMethodWorker.java:127)
   [testng] 	at org.testng.internal.TestMethodWorker.run(TestMethodWorker.java:111)
   [testng] 	at java.base/java.util.concurrent.ThreadPoolExecutor.runWorker(ThreadPoolExecutor.java:1136)
   [testng] 	at java.base/java.util.concurrent.ThreadPoolExecutor$Worker.run(ThreadPoolExecutor.java:635)
   [testng] 	at java.base/java.lang.Thread.run(Thread.java:833)
   [testng] [2024-05-01 01:37:12,878] [pool-1-thread-1] 	testMemoFileUsage: FAILED (Memo file not saved)
   [testng] [2024-05-01 01:37:12,878] [pool-1-thread-1] memo file size not available
   [testng] [2024-05-01 01:37:13,146] [pool-1-thread-3] Initializing /data/stephane/002007000.flex: 
   [testng] [2024-05-01 01:37:13,538] [pool-1-thread-3] 	testMemoFileUsage: FAILED (Memo file not saved)
   [testng] [2024-05-01 01:37:13,538] [pool-1-thread-3] 
   [testng] java.lang.AssertionError: Memo file not saved
   [testng] 	at loci.tests.testng.FormatReaderTest.result(FormatReaderTest.java:3296)
   [testng] 	at loci.tests.testng.FormatReaderTest.testMemoFileUsage(FormatReaderTest.java:2959)
   [testng] 	at jdk.internal.reflect.GeneratedMethodAccessor32.invoke(Unknown Source)
   [testng] 	at java.base/jdk.internal.reflect.DelegatingMethodAccessorImpl.invoke(DelegatingMethodAccessorImpl.java:43)
   [testng] 	at java.base/java.lang.reflect.Method.invoke(Method.java:568)
   [testng] 	at org.testng.internal.MethodInvocationHelper.invokeMethod(MethodInvocationHelper.java:80)
   [testng] 	at org.testng.internal.Invoker.invokeMethod(Invoker.java:714)
   [testng] 	at org.testng.internal.Invoker.invokeTestMethod(Invoker.java:901)
   [testng] 	at org.testng.internal.Invoker.invokeTestMethods(Invoker.java:1231)
   [testng] 	at org.testng.internal.TestMethodWorker.invokeTestMethods(TestMethodWorker.java:127)
   [testng] 	at org.testng.internal.TestMethodWorker.run(TestMethodWorker.java:111)
   [testng] 	at java.base/java.util.concurrent.ThreadPoolExecutor.runWorker(ThreadPoolExecutor.java:1136)
   [testng] 	at java.base/java.util.concurrent.ThreadPoolExecutor$Worker.run(ThreadPoolExecutor.java:635)
   [testng] 	at java.base/java.lang.Thread.run(Thread.java:833)
   [testng] [2024-05-01 01:37:13,538] [pool-1-thread-3] 	testMemoFileUsage: FAILED (Memo file not saved)
   [testng] [2024-05-01 01:37:13,538] [pool-1-thread-3] memo file size not available
   [testng] [2024-05-01 01:37:31,075] [pool-1-thread-2] 	testMemoFileUsage: FAILED (Memo file not saved)
   [testng] [2024-05-01 01:37:31,075] [pool-1-thread-2] 
   [testng] java.lang.AssertionError: Memo file not saved
   [testng] 	at loci.tests.testng.FormatReaderTest.result(FormatReaderTest.java:3296)
   [testng] 	at loci.tests.testng.FormatReaderTest.testMemoFileUsage(FormatReaderTest.java:2959)
   [testng] 	at jdk.internal.reflect.GeneratedMethodAccessor32.invoke(Unknown Source)
   [testng] 	at java.base/jdk.internal.reflect.DelegatingMethodAccessorImpl.invoke(DelegatingMethodAccessorImpl.java:43)
   [testng] 	at java.base/java.lang.reflect.Method.invoke(Method.java:568)
   [testng] 	at org.testng.internal.MethodInvocationHelper.invokeMethod(MethodInvocationHelper.java:80)
   [testng] 	at org.testng.internal.Invoker.invokeMethod(Invoker.java:714)
   [testng] 	at org.testng.internal.Invoker.invokeTestMethod(Invoker.java:901)
   [testng] 	at org.testng.internal.Invoker.invokeTestMethods(Invoker.java:1231)
   [testng] 	at org.testng.internal.TestMethodWorker.invokeTestMethods(TestMethodWorker.java:127)
   [testng] 	at org.testng.internal.TestMethodWorker.run(TestMethodWorker.java:111)
   [testng] 	at java.base/java.util.concurrent.ThreadPoolExecutor.runWorker(ThreadPoolExecutor.java:1136)
   [testng] 	at java.base/java.util.concurrent.ThreadPoolExecutor$Worker.run(ThreadPoolExecutor.java:635)
   [testng] 	at java.base/java.lang.Thread.run(Thread.java:833)
   [testng] [2024-05-01 01:37:31,075] [pool-1-thread-2] 	testMemoFileUsage: FAILED (Memo file not saved)
   [testng] [2024-05-01 01:37:31,075] [pool-1-thread-2] memo file size not available
   [testng] [2024-05-01 01:37:34,981] [pool-1-thread-10] 	testMemoFileUsage: FAILED (Memo file not saved)
   [testng] [2024-05-01 01:37:34,981] [pool-1-thread-10] 
   [testng] java.lang.AssertionError: Memo file not saved
   [testng] 	at loci.tests.testng.FormatReaderTest.result(FormatReaderTest.java:3296)
   [testng] 	at loci.tests.testng.FormatReaderTest.testMemoFileUsage(FormatReaderTest.java:2959)
   [testng] 	at jdk.internal.reflect.GeneratedMethodAccessor32.invoke(Unknown Source)
   [testng] 	at java.base/jdk.internal.reflect.DelegatingMethodAccessorImpl.invoke(DelegatingMethodAccessorImpl.java:43)
   [testng] 	at java.base/java.lang.reflect.Method.invoke(Method.java:568)
   [testng] 	at org.testng.internal.MethodInvocationHelper.invokeMethod(MethodInvocationHelper.java:80)
   [testng] 	at org.testng.internal.Invoker.invokeMethod(Invoker.java:714)
   [testng] 	at org.testng.internal.Invoker.invokeTestMethod(Invoker.java:901)
   [testng] 	at org.testng.internal.Invoker.invokeTestMethods(Invoker.java:1231)
   [testng] 	at org.testng.internal.TestMethodWorker.invokeTestMethods(TestMethodWorker.java:127)
   [testng] 	at org.testng.internal.TestMethodWorker.run(TestMethodWorker.java:111)
   [testng] 	at java.base/java.util.concurrent.ThreadPoolExecutor.runWorker(ThreadPoolExecutor.java:1136)
   [testng] 	at java.base/java.util.concurrent.ThreadPoolExecutor$Worker.run(ThreadPoolExecutor.java:635)
   [testng] 	at java.base/java.lang.Thread.run(Thread.java:833)
   [testng] [2024-05-01 01:37:34,981] [pool-1-thread-10] 	testMemoFileUsage: FAILED (Memo file not saved)
   [testng] [2024-05-01 01:37:34,981] [pool-1-thread-10] memo file size not available
   [testng] [2024-05-01 01:37:50,695] [pool-1-thread-11] 	testMemoFileUsage: FAILED (Memo file not saved)
   [testng] [2024-05-01 01:37:50,695] [pool-1-thread-11] 
   [testng] java.lang.AssertionError: Memo file not saved
   [testng] 	at loci.tests.testng.FormatReaderTest.result(FormatReaderTest.java:3296)
   [testng] 	at loci.tests.testng.FormatReaderTest.testMemoFileUsage(FormatReaderTest.java:2959)
   [testng] 	at jdk.internal.reflect.GeneratedMethodAccessor32.invoke(Unknown Source)
   [testng] 	at java.base/jdk.internal.reflect.DelegatingMethodAccessorImpl.invoke(DelegatingMethodAccessorImpl.java:43)
   [testng] 	at java.base/java.lang.reflect.Method.invoke(Method.java:568)
   [testng] 	at org.testng.internal.MethodInvocationHelper.invokeMethod(MethodInvocationHelper.java:80)
   [testng] 	at org.testng.internal.Invoker.invokeMethod(Invoker.java:714)
   [testng] 	at org.testng.internal.Invoker.invokeTestMethod(Invoker.java:901)
   [testng] 	at org.testng.internal.Invoker.invokeTestMethods(Invoker.java:1231)
   [testng] 	at org.testng.internal.TestMethodWorker.invokeTestMethods(TestMethodWorker.java:127)
   [testng] 	at org.testng.internal.TestMethodWorker.run(TestMethodWorker.java:111)
   [testng] 	at java.base/java.util.concurrent.ThreadPoolExecutor.runWorker(ThreadPoolExecutor.java:1136)
   [testng] 	at java.base/java.util.concurrent.ThreadPoolExecutor$Worker.run(ThreadPoolExecutor.java:635)
   [testng] 	at java.base/java.lang.Thread.run(Thread.java:833)
   [testng] [2024-05-01 01:37:50,695] [pool-1-thread-11] 	testMemoFileUsage: FAILED (Memo file not saved)
   [testng] [2024-05-01 01:37:50,696] [pool-1-thread-11] memo file size not available
   [testng] [2024-05-01 01:39:42,244] [pool-1-thread-9] 	testMemoFileUsage: FAILED (Memo file not saved)
   [testng] [2024-05-01 01:39:42,244] [pool-1-thread-9] 
   [testng] java.lang.AssertionError: Memo file not saved
   [testng] 	at loci.tests.testng.FormatReaderTest.result(FormatReaderTest.java:3296)
   [testng] 	at loci.tests.testng.FormatReaderTest.testMemoFileUsage(FormatReaderTest.java:2959)
   [testng] 	at jdk.internal.reflect.GeneratedMethodAccessor32.invoke(Unknown Source)
   [testng] 	at java.base/jdk.internal.reflect.DelegatingMethodAccessorImpl.invoke(DelegatingMethodAccessorImpl.java:43)
   [testng] 	at java.base/java.lang.reflect.Method.invoke(Method.java:568)
   [testng] 	at org.testng.internal.MethodInvocationHelper.invokeMethod(MethodInvocationHelper.java:80)
   [testng] 	at org.testng.internal.Invoker.invokeMethod(Invoker.java:714)
   [testng] 	at org.testng.internal.Invoker.invokeTestMethod(Invoker.java:901)
   [testng] 	at org.testng.internal.Invoker.invokeTestMethods(Invoker.java:1231)
   [testng] 	at org.testng.internal.TestMethodWorker.invokeTestMethods(TestMethodWorker.java:127)
   [testng] 	at org.testng.internal.TestMethodWorker.run(TestMethodWorker.java:111)
   [testng] 	at java.base/java.util.concurrent.ThreadPoolExecutor.runWorker(ThreadPoolExecutor.java:1136)
   [testng] 	at java.base/java.util.concurrent.ThreadPoolExecutor$Worker.run(ThreadPoolExecutor.java:635)
   [testng] 	at java.base/java.lang.Thread.run(Thread.java:833)
   [testng] [2024-05-01 01:39:42,244] [pool-1-thread-9] 	testMemoFileUsage: FAILED (Memo file not saved)
   [testng] [2024-05-01 01:39:42,244] [pool-1-thread-9] memo file size not available
   [testng] [2024-05-01 01:39:42,491] [pool-1-thread-8] 	testMemoFileUsage: FAILED (Memo file not saved)
   [testng] [2024-05-01 01:39:42,491] [pool-1-thread-8] 
   [testng] java.lang.AssertionError: Memo file not saved
   [testng] 	at loci.tests.testng.FormatReaderTest.result(FormatReaderTest.java:3296)
   [testng] 	at loci.tests.testng.FormatReaderTest.testMemoFileUsage(FormatReaderTest.java:2959)
   [testng] 	at jdk.internal.reflect.GeneratedMethodAccessor32.invoke(Unknown Source)
   [testng] 	at java.base/jdk.internal.reflect.DelegatingMethodAccessorImpl.invoke(DelegatingMethodAccessorImpl.java:43)
   [testng] 	at java.base/java.lang.reflect.Method.invoke(Method.java:568)
   [testng] 	at org.testng.internal.MethodInvocationHelper.invokeMethod(MethodInvocationHelper.java:80)
   [testng] 	at org.testng.internal.Invoker.invokeMethod(Invoker.java:714)
   [testng] 	at org.testng.internal.Invoker.invokeTestMethod(Invoker.java:901)
   [testng] 	at org.testng.internal.Invoker.invokeTestMethods(Invoker.java:1231)
   [testng] 	at org.testng.internal.TestMethodWorker.invokeTestMethods(TestMethodWorker.java:127)
   [testng] 	at org.testng.internal.TestMethodWorker.run(TestMethodWorker.java:111)
   [testng] 	at java.base/java.util.concurrent.ThreadPoolExecutor.runWorker(ThreadPoolExecutor.java:1136)
   [testng] 	at java.base/java.util.concurrent.ThreadPoolExecutor$Worker.run(ThreadPoolExecutor.java:635)
   [testng] 	at java.base/java.lang.Thread.run(Thread.java:833)
   [testng] [2024-05-01 01:39:42,491] [pool-1-thread-8] 	testMemoFileUsage: FAILED (Memo file not saved)
   [testng] [2024-05-01 01:39:42,491] [pool-1-thread-8] memo file size not available
   [testng] [2024-05-01 01:39:46,276] [pool-1-thread-12] 	testMemoFileUsage: FAILED (Memo file not saved)
   [testng] [2024-05-01 01:39:46,276] [pool-1-thread-12] 
   [testng] java.lang.AssertionError: Memo file not saved
   [testng] 	at loci.tests.testng.FormatReaderTest.result(FormatReaderTest.java:3296)
   [testng] 	at loci.tests.testng.FormatReaderTest.testMemoFileUsage(FormatReaderTest.java:2959)
   [testng] 	at jdk.internal.reflect.GeneratedMethodAccessor32.invoke(Unknown Source)
   [testng] 	at java.base/jdk.internal.reflect.DelegatingMethodAccessorImpl.invoke(DelegatingMethodAccessorImpl.java:43)
   [testng] 	at java.base/java.lang.reflect.Method.invoke(Method.java:568)
   [testng] 	at org.testng.internal.MethodInvocationHelper.invokeMethod(MethodInvocationHelper.java:80)
   [testng] 	at org.testng.internal.Invoker.invokeMethod(Invoker.java:714)
   [testng] 	at org.testng.internal.Invoker.invokeTestMethod(Invoker.java:901)
   [testng] 	at org.testng.internal.Invoker.invokeTestMethods(Invoker.java:1231)
   [testng] 	at org.testng.internal.TestMethodWorker.invokeTestMethods(TestMethodWorker.java:127)
   [testng] 	at org.testng.internal.TestMethodWorker.run(TestMethodWorker.java:111)
   [testng] 	at java.base/java.util.concurrent.ThreadPoolExecutor.runWorker(ThreadPoolExecutor.java:1136)
   [testng] 	at java.base/java.util.concurrent.ThreadPoolExecutor$Worker.run(ThreadPoolExecutor.java:635)
   [testng] 	at java.base/java.lang.Thread.run(Thread.java:833)
   [testng] [2024-05-01 01:39:46,276] [pool-1-thread-12] 	testMemoFileUsage: FAILED (Memo file not saved)
   [testng] [2024-05-01 01:39:46,276] [pool-1-thread-12] memo file size not available
   [testng] [2024-05-01 01:39:47,062] [pool-1-thread-4] 	testMemoFileUsage: FAILED (Memo file not saved)
   [testng] [2024-05-01 01:39:47,062] [pool-1-thread-4] 
   [testng] java.lang.AssertionError: Memo file not saved
   [testng] 	at loci.tests.testng.FormatReaderTest.result(FormatReaderTest.java:3296)
   [testng] 	at loci.tests.testng.FormatReaderTest.testMemoFileUsage(FormatReaderTest.java:2959)
   [testng] 	at jdk.internal.reflect.GeneratedMethodAccessor32.invoke(Unknown Source)
   [testng] 	at java.base/jdk.internal.reflect.DelegatingMethodAccessorImpl.invoke(DelegatingMethodAccessorImpl.java:43)
   [testng] 	at java.base/java.lang.reflect.Method.invoke(Method.java:568)
   [testng] 	at org.testng.internal.MethodInvocationHelper.invokeMethod(MethodInvocationHelper.java:80)
   [testng] 	at org.testng.internal.Invoker.invokeMethod(Invoker.java:714)
   [testng] 	at org.testng.internal.Invoker.invokeTestMethod(Invoker.java:901)
   [testng] 	at org.testng.internal.Invoker.invokeTestMethods(Invoker.java:1231)
   [testng] 	at org.testng.internal.TestMethodWorker.invokeTestMethods(TestMethodWorker.java:127)
   [testng] 	at org.testng.internal.TestMethodWorker.run(TestMethodWorker.java:111)
   [testng] 	at java.base/java.util.concurrent.ThreadPoolExecutor.runWorker(ThreadPoolExecutor.java:1136)
   [testng] 	at java.base/java.util.concurrent.ThreadPoolExecutor$Worker.run(ThreadPoolExecutor.java:635)
   [testng] 	at java.base/java.lang.Thread.run(Thread.java:833)
   [testng] [2024-05-01 01:39:47,062] [pool-1-thread-4] 	testMemoFileUsage: FAILED (Memo file not saved)
   [testng] [2024-05-01 01:39:47,062] [pool-1-thread-4] memo file size not available
   [testng] [2024-05-01 01:39:49,578] [pool-1-thread-5] 	testMemoFileUsage: FAILED (Memo file not saved)
   [testng] [2024-05-01 01:39:49,578] [pool-1-thread-5] 
   [testng] java.lang.AssertionError: Memo file not saved
   [testng] 	at loci.tests.testng.FormatReaderTest.result(FormatReaderTest.java:3296)
   [testng] 	at loci.tests.testng.FormatReaderTest.testMemoFileUsage(FormatReaderTest.java:2959)
   [testng] 	at jdk.internal.reflect.GeneratedMethodAccessor32.invoke(Unknown Source)
   [testng] 	at java.base/jdk.internal.reflect.DelegatingMethodAccessorImpl.invoke(DelegatingMethodAccessorImpl.java:43)
   [testng] 	at java.base/java.lang.reflect.Method.invoke(Method.java:568)
   [testng] 	at org.testng.internal.MethodInvocationHelper.invokeMethod(MethodInvocationHelper.java:80)
   [testng] 	at org.testng.internal.Invoker.invokeMethod(Invoker.java:714)
   [testng] 	at org.testng.internal.Invoker.invokeTestMethod(Invoker.java:901)
   [testng] 	at org.testng.internal.Invoker.invokeTestMethods(Invoker.java:1231)
   [testng] 	at org.testng.internal.TestMethodWorker.invokeTestMethods(TestMethodWorker.java:127)
   [testng] 	at org.testng.internal.TestMethodWorker.run(TestMethodWorker.java:111)
   [testng] 	at java.base/java.util.concurrent.ThreadPoolExecutor.runWorker(ThreadPoolExecutor.java:1136)
   [testng] 	at java.base/java.util.concurrent.ThreadPoolExecutor$Worker.run(ThreadPoolExecutor.java:635)
   [testng] 	at java.base/java.lang.Thread.run(Thread.java:833)
   [testng] [2024-05-01 01:39:49,578] [pool-1-thread-5] 	testMemoFileUsage: FAILED (Memo file not saved)
   [testng] [2024-05-01 01:39:49,578] [pool-1-thread-5] memo file size not available
   [testng] [2024-05-01 01:39:51,163] [pool-1-thread-7] 	testMemoFileUsage: FAILED (Memo file not saved)
   [testng] [2024-05-01 01:39:51,163] [pool-1-thread-7] 
   [testng] java.lang.AssertionError: Memo file not saved
   [testng] 	at loci.tests.testng.FormatReaderTest.result(FormatReaderTest.java:3296)
   [testng] 	at loci.tests.testng.FormatReaderTest.testMemoFileUsage(FormatReaderTest.java:2959)
   [testng] 	at jdk.internal.reflect.GeneratedMethodAccessor32.invoke(Unknown Source)
   [testng] 	at java.base/jdk.internal.reflect.DelegatingMethodAccessorImpl.invoke(DelegatingMethodAccessorImpl.java:43)
   [testng] 	at java.base/java.lang.reflect.Method.invoke(Method.java:568)
   [testng] 	at org.testng.internal.MethodInvocationHelper.invokeMethod(MethodInvocationHelper.java:80)
   [testng] 	at org.testng.internal.Invoker.invokeMethod(Invoker.java:714)
   [testng] 	at org.testng.internal.Invoker.invokeTestMethod(Invoker.java:901)
   [testng] 	at org.testng.internal.Invoker.invokeTestMethods(Invoker.java:1231)
   [testng] 	at org.testng.internal.TestMethodWorker.invokeTestMethods(TestMethodWorker.java:127)
   [testng] 	at org.testng.internal.TestMethodWorker.run(TestMethodWorker.java:111)
   [testng] 	at java.base/java.util.concurrent.ThreadPoolExecutor.runWorker(ThreadPoolExecutor.java:1136)
   [testng] 	at java.base/java.util.concurrent.ThreadPoolExecutor$Worker.run(ThreadPoolExecutor.java:635)
   [testng] 	at java.base/java.lang.Thread.run(Thread.java:833)
   [testng] [2024-05-01 01:39:51,163] [pool-1-thread-7] 	testMemoFileUsage: FAILED (Memo file not saved)
   [testng] [2024-05-01 01:39:51,164] [pool-1-thread-7] memo file size not available
   [testng] 
   [testng] ===============================================
   [testng] Bio-Formats software test suite
   [testng] Total tests run: 2226, Failures: 37, Skips: 0
   [testng] ===============================================
   [testng] 
   [testng] The tests failed.

BUILD FAILED
/bio-formats-build/bioformats/components/test-suite/build.xml:270: if=failedTest

Total time: 9 minutes 40 seconds
Build step 'Execute shell' marked build as failure
Finished: FAILURE