FailedConsole Output

Started by upstream project "Trigger" build number 68
originally caused by:
 Started by user devspace
 Restarted from build #67, stage OMERO Matlab
Obtained Jenkinsfile from git https://github.com/snoopycrimecop/omero-matlab.git
Running in Durability level: MAX_SURVIVABILITY
[Pipeline] Start of Pipeline
[Pipeline] node
Running on testintegration in /home/omero/workspace/OMERO-matlab-build
[Pipeline] {
[Pipeline] stage
[Pipeline] { (Declarative: Checkout SCM)
[Pipeline] checkout
No credentials specified
Cloning the remote Git repository
Cloning repository https://github.com/snoopycrimecop/omero-matlab.git
 > git init /home/omero/workspace/OMERO-matlab-build # timeout=10
Fetching upstream changes from https://github.com/snoopycrimecop/omero-matlab.git
 > git --version # timeout=10
 > git fetch --tags --progress https://github.com/snoopycrimecop/omero-matlab.git +refs/heads/*:refs/remotes/origin/* # timeout=10
Cleaning workspace
 > git config remote.origin.url https://github.com/snoopycrimecop/omero-matlab.git # timeout=10
 > git config --add remote.origin.fetch +refs/heads/*:refs/remotes/origin/* # timeout=10
 > git config remote.origin.url https://github.com/snoopycrimecop/omero-matlab.git # timeout=10
 > git rev-parse --verify HEAD # timeout=10
No valid HEAD. Skipping the resetting
 > git clean -fdx # timeout=10
Fetching upstream changes from https://github.com/snoopycrimecop/omero-matlab.git
 > git fetch --tags --progress https://github.com/snoopycrimecop/omero-matlab.git +refs/heads/*:refs/remotes/origin/* # timeout=10
Checking out Revision d8956e73e2cd0ee6863a6d6823348e11ced22a11 (origin/south_merge_trigger)
Commit message: "merge master -Dorg -Ssuccess-only"
First time build. Skipping changelog.
[Pipeline] }
[Pipeline] // stage
[Pipeline] withEnv
[Pipeline] {
[Pipeline] withEnv
[Pipeline] {
[Pipeline] stage
[Pipeline] { (Build)
[Pipeline] sh
+ gradle --init-script init-ci.gradle publishToMavenLocal build --refresh-dependencies
 > git rev-parse origin/south_merge_trigger^{commit} # timeout=10
 > git config core.sparsecheckout # timeout=10
 > git checkout -f d8956e73e2cd0ee6863a6d6823348e11ced22a11 # timeout=10
To honour the JVM settings for this build a new JVM will be forked. Please consider using the daemon: https://docs.gradle.org/5.2.1/userguide/gradle_daemon.html.
Daemon will be stopped at the end of the build stopping after processing

FAILURE: Build failed with an exception.

* What went wrong:
The specified initialization script '/home/omero/workspace/OMERO-matlab-build/init-ci.gradle' does not exist.

* Try:
Run with --stacktrace option to get the stack trace. Run with --info or --debug option to get more log output. Run with --scan to get full insights.

* Get more help at https://help.gradle.org

BUILD FAILED in 1s
[Pipeline] }
[Pipeline] // stage
[Pipeline] stage
[Pipeline] { (Deploy)
Stage "Deploy" skipped due to earlier failure(s)
[Pipeline] }
[Pipeline] // stage
[Pipeline] stage
[Pipeline] { (Declarative: Post Actions)
[Pipeline] deleteDir
[Pipeline] }
[Pipeline] // stage
[Pipeline] }
[Pipeline] // withEnv
[Pipeline] }
[Pipeline] // withEnv
[Pipeline] }
[Pipeline] // node
[Pipeline] End of Pipeline
ERROR: script returned exit code 1
Finished: FAILURE