Skip to content

Console Output

Skipping 804 KB.. Full Log
	... 7 common frames omitted
02:09:34 2025-02-22 02:09:34,794 ERROR [ o.formats.importer.util.ClientKeepAlive] (1-thread-1) Exception while executing ping(), logging Connector out: 
02:09:34 java.lang.RuntimeException: Ice.CommunicatorDestroyedException
02:09:34 	at ome.formats.OMEROMetadataStoreClient.ping(OMEROMetadataStoreClient.java:845)
02:09:34 	at ome.formats.importer.util.ClientKeepAlive.run(ClientKeepAlive.java:77)
02:09:34 	at java.base/java.util.concurrent.Executors$RunnableAdapter.call(Executors.java:515)
02:09:34 	at java.base/java.util.concurrent.FutureTask.runAndReset(FutureTask.java:305)
02:09:34 	at java.base/java.util.concurrent.ScheduledThreadPoolExecutor$ScheduledFutureTask.run(ScheduledThreadPoolExecutor.java:305)
02:09:34 	at java.base/java.util.concurrent.ThreadPoolExecutor.runWorker(ThreadPoolExecutor.java:1128)
02:09:34 	at java.base/java.util.concurrent.ThreadPoolExecutor$Worker.run(ThreadPoolExecutor.java:628)
02:09:34 	at java.base/java.lang.Thread.run(Thread.java:829)
02:09:34 Caused by: Ice.CommunicatorDestroyedException: null
02:09:34 	at IceInternal.Instance.proxyFactory(Instance.java:239)
02:09:34 	at IceInternal.BasicStream.writeProxy(BasicStream.java:2142)
02:09:34 	at omero.api.ServiceInterfacePrxHelper.__write(ServiceInterfacePrxHelper.java:114)
02:09:34 	at omero.api.ServiceListHelper.write(ServiceListHelper.java:37)
02:09:34 	at omero.api.ServiceFactoryPrxHelper.begin_keepAllAlive(ServiceFactoryPrxHelper.java:5946)
02:09:34 	at omero.api.ServiceFactoryPrxHelper.keepAllAlive(ServiceFactoryPrxHelper.java:5846)
02:09:34 	at omero.api.ServiceFactoryPrxHelper.keepAllAlive(ServiceFactoryPrxHelper.java:5833)
02:09:34 	at ome.formats.OMEROMetadataStoreClient.ping(OMEROMetadataStoreClient.java:838)
02:09:34 	... 7 common frames omitted
02:09:35 2025-02-22 02:09:35,638 ERROR [ o.formats.importer.util.ClientKeepAlive] (2-thread-1) Exception while executing ping(), logging Connector out: 
02:09:35 java.lang.RuntimeException: Ice.CommunicatorDestroyedException
02:09:35 	at ome.formats.OMEROMetadataStoreClient.ping(OMEROMetadataStoreClient.java:845)
02:09:35 	at ome.formats.importer.util.ClientKeepAlive.run(ClientKeepAlive.java:77)
02:09:35 	at java.base/java.util.concurrent.Executors$RunnableAdapter.call(Executors.java:515)
02:09:35 	at java.base/java.util.concurrent.FutureTask.runAndReset(FutureTask.java:305)
02:09:35 	at java.base/java.util.concurrent.ScheduledThreadPoolExecutor$ScheduledFutureTask.run(ScheduledThreadPoolExecutor.java:305)
02:09:35 	at java.base/java.util.concurrent.ThreadPoolExecutor.runWorker(ThreadPoolExecutor.java:1128)
02:09:35 	at java.base/java.util.concurrent.ThreadPoolExecutor$Worker.run(ThreadPoolExecutor.java:628)
02:09:35 	at java.base/java.lang.Thread.run(Thread.java:829)
02:09:35 Caused by: Ice.CommunicatorDestroyedException: null
02:09:35 	at IceInternal.Instance.proxyFactory(Instance.java:239)
02:09:35 	at IceInternal.BasicStream.writeProxy(BasicStream.java:2142)
02:09:35 	at omero.api.ServiceInterfacePrxHelper.__write(ServiceInterfacePrxHelper.java:114)
02:09:35 	at omero.api.ServiceListHelper.write(ServiceListHelper.java:37)
02:09:35 	at omero.api.ServiceFactoryPrxHelper.begin_keepAllAlive(ServiceFactoryPrxHelper.java:5946)
02:09:35 	at omero.api.ServiceFactoryPrxHelper.keepAllAlive(ServiceFactoryPrxHelper.java:5846)
02:09:35 	at omero.api.ServiceFactoryPrxHelper.keepAllAlive(ServiceFactoryPrxHelper.java:5833)
02:09:35 	at ome.formats.OMEROMetadataStoreClient.ping(OMEROMetadataStoreClient.java:838)
02:09:35 	... 7 common frames omitted
02:09:43 2025-02-22 02:09:43,323 ERROR [ o.formats.importer.util.ClientKeepAlive] (4-thread-1) Exception while executing ping(), logging Connector out: 
02:09:43 java.lang.RuntimeException: Ice.CommunicatorDestroyedException
02:09:43 	at ome.formats.OMEROMetadataStoreClient.ping(OMEROMetadataStoreClient.java:845)
02:09:43 	at ome.formats.importer.util.ClientKeepAlive.run(ClientKeepAlive.java:77)
02:09:43 	at java.base/java.util.concurrent.Executors$RunnableAdapter.call(Executors.java:515)
02:09:43 	at java.base/java.util.concurrent.FutureTask.runAndReset(FutureTask.java:305)
02:09:43 	at java.base/java.util.concurrent.ScheduledThreadPoolExecutor$ScheduledFutureTask.run(ScheduledThreadPoolExecutor.java:305)
02:09:43 	at java.base/java.util.concurrent.ThreadPoolExecutor.runWorker(ThreadPoolExecutor.java:1128)
02:09:43 	at java.base/java.util.concurrent.ThreadPoolExecutor$Worker.run(ThreadPoolExecutor.java:628)
02:09:43 	at java.base/java.lang.Thread.run(Thread.java:829)
02:09:43 Caused by: Ice.CommunicatorDestroyedException: null
02:09:43 	at IceInternal.Instance.proxyFactory(Instance.java:239)
02:09:43 	at IceInternal.BasicStream.writeProxy(BasicStream.java:2142)
02:09:43 	at omero.api.ServiceInterfacePrxHelper.__write(ServiceInterfacePrxHelper.java:114)
02:09:43 	at omero.api.ServiceListHelper.write(ServiceListHelper.java:37)
02:09:43 	at omero.api.ServiceFactoryPrxHelper.begin_keepAllAlive(ServiceFactoryPrxHelper.java:5946)
02:09:43 	at omero.api.ServiceFactoryPrxHelper.keepAllAlive(ServiceFactoryPrxHelper.java:5846)
02:09:43 	at omero.api.ServiceFactoryPrxHelper.keepAllAlive(ServiceFactoryPrxHelper.java:5833)
02:09:43 	at ome.formats.OMEROMetadataStoreClient.ping(OMEROMetadataStoreClient.java:838)
02:09:43 	... 7 common frames omitted
02:09:44 2025-02-22 02:09:44,144 ERROR [ o.formats.importer.util.ClientKeepAlive] (5-thread-1) Exception while executing ping(), logging Connector out: 
02:09:44 java.lang.RuntimeException: Ice.CommunicatorDestroyedException
02:09:44 	at ome.formats.OMEROMetadataStoreClient.ping(OMEROMetadataStoreClient.java:845)
02:09:44 	at ome.formats.importer.util.ClientKeepAlive.run(ClientKeepAlive.java:77)
02:09:44 	at java.base/java.util.concurrent.Executors$RunnableAdapter.call(Executors.java:515)
02:09:44 	at java.base/java.util.concurrent.FutureTask.runAndReset(FutureTask.java:305)
02:09:44 	at java.base/java.util.concurrent.ScheduledThreadPoolExecutor$ScheduledFutureTask.run(ScheduledThreadPoolExecutor.java:305)
02:09:44 	at java.base/java.util.concurrent.ThreadPoolExecutor.runWorker(ThreadPoolExecutor.java:1128)
02:09:44 	at java.base/java.util.concurrent.ThreadPoolExecutor$Worker.run(ThreadPoolExecutor.java:628)
02:09:44 	at java.base/java.lang.Thread.run(Thread.java:829)
02:09:44 Caused by: Ice.CommunicatorDestroyedException: null
02:09:44 	at IceInternal.Instance.proxyFactory(Instance.java:239)
02:09:44 	at IceInternal.BasicStream.writeProxy(BasicStream.java:2142)
02:09:44 	at omero.api.ServiceInterfacePrxHelper.__write(ServiceInterfacePrxHelper.java:114)
02:09:44 	at omero.api.ServiceListHelper.write(ServiceListHelper.java:37)
02:09:44 	at omero.api.ServiceFactoryPrxHelper.begin_keepAllAlive(ServiceFactoryPrxHelper.java:5946)
02:09:44 	at omero.api.ServiceFactoryPrxHelper.keepAllAlive(ServiceFactoryPrxHelper.java:5846)
02:09:44 	at omero.api.ServiceFactoryPrxHelper.keepAllAlive(ServiceFactoryPrxHelper.java:5833)
02:09:44 	at ome.formats.OMEROMetadataStoreClient.ping(OMEROMetadataStoreClient.java:838)
02:09:44 	... 7 common frames omitted
02:09:50 2025-02-22 02:09:50,779 ERROR [ o.formats.importer.util.ClientKeepAlive] (7-thread-1) Exception while executing ping(), logging Connector out: 
02:09:50 java.lang.RuntimeException: Ice.CommunicatorDestroyedException
02:09:50 	at ome.formats.OMEROMetadataStoreClient.ping(OMEROMetadataStoreClient.java:845)
02:09:50 	at ome.formats.importer.util.ClientKeepAlive.run(ClientKeepAlive.java:77)
02:09:50 	at java.base/java.util.concurrent.Executors$RunnableAdapter.call(Executors.java:515)
02:09:50 	at java.base/java.util.concurrent.FutureTask.runAndReset(FutureTask.java:305)
02:09:50 	at java.base/java.util.concurrent.ScheduledThreadPoolExecutor$ScheduledFutureTask.run(ScheduledThreadPoolExecutor.java:305)
02:09:50 	at java.base/java.util.concurrent.ThreadPoolExecutor.runWorker(ThreadPoolExecutor.java:1128)
02:09:50 	at java.base/java.util.concurrent.ThreadPoolExecutor$Worker.run(ThreadPoolExecutor.java:628)
02:09:50 	at java.base/java.lang.Thread.run(Thread.java:829)
02:09:50 Caused by: Ice.CommunicatorDestroyedException: null
02:09:50 	at IceInternal.Instance.proxyFactory(Instance.java:239)
02:09:50 	at IceInternal.BasicStream.writeProxy(BasicStream.java:2142)
02:09:50 	at omero.api.ServiceInterfacePrxHelper.__write(ServiceInterfacePrxHelper.java:114)
02:09:50 	at omero.api.ServiceListHelper.write(ServiceListHelper.java:37)
02:09:50 	at omero.api.ServiceFactoryPrxHelper.begin_keepAllAlive(ServiceFactoryPrxHelper.java:5946)
02:09:50 	at omero.api.ServiceFactoryPrxHelper.keepAllAlive(ServiceFactoryPrxHelper.java:5846)
02:09:50 	at omero.api.ServiceFactoryPrxHelper.keepAllAlive(ServiceFactoryPrxHelper.java:5833)
02:09:50 	at ome.formats.OMEROMetadataStoreClient.ping(OMEROMetadataStoreClient.java:838)
02:09:50 	... 7 common frames omitted
02:09:51 2025-02-22 02:09:51,650 ERROR [ o.formats.importer.util.ClientKeepAlive] (8-thread-1) Exception while executing ping(), logging Connector out: 
02:09:51 java.lang.RuntimeException: Ice.CommunicatorDestroyedException
02:09:51 	at ome.formats.OMEROMetadataStoreClient.ping(OMEROMetadataStoreClient.java:845)
02:09:51 	at ome.formats.importer.util.ClientKeepAlive.run(ClientKeepAlive.java:77)
02:09:51 	at java.base/java.util.concurrent.Executors$RunnableAdapter.call(Executors.java:515)
02:09:51 	at java.base/java.util.concurrent.FutureTask.runAndReset(FutureTask.java:305)
02:09:51 	at java.base/java.util.concurrent.ScheduledThreadPoolExecutor$ScheduledFutureTask.run(ScheduledThreadPoolExecutor.java:305)
02:09:51 	at java.base/java.util.concurrent.ThreadPoolExecutor.runWorker(ThreadPoolExecutor.java:1128)
02:09:51 	at java.base/java.util.concurrent.ThreadPoolExecutor$Worker.run(ThreadPoolExecutor.java:628)
02:09:51 	at java.base/java.lang.Thread.run(Thread.java:829)
02:09:51 Caused by: Ice.CommunicatorDestroyedException: null
02:09:51 	at IceInternal.Instance.proxyFactory(Instance.java:239)
02:09:51 	at IceInternal.BasicStream.writeProxy(BasicStream.java:2142)
02:09:51 	at omero.api.ServiceInterfacePrxHelper.__write(ServiceInterfacePrxHelper.java:114)
02:09:51 	at omero.api.ServiceListHelper.write(ServiceListHelper.java:37)
02:09:51 	at omero.api.ServiceFactoryPrxHelper.begin_keepAllAlive(ServiceFactoryPrxHelper.java:5946)
02:09:51 	at omero.api.ServiceFactoryPrxHelper.keepAllAlive(ServiceFactoryPrxHelper.java:5846)
02:09:51 	at omero.api.ServiceFactoryPrxHelper.keepAllAlive(ServiceFactoryPrxHelper.java:5833)
02:09:51 	at ome.formats.OMEROMetadataStoreClient.ping(OMEROMetadataStoreClient.java:838)
02:09:51 	... 7 common frames omitted
02:09:59 2025-02-22 02:09:59,136 ERROR [ o.formats.importer.util.ClientKeepAlive] (0-thread-1) Exception while executing ping(), logging Connector out: 
02:09:59 java.lang.RuntimeException: Ice.CommunicatorDestroyedException
02:09:59 	at ome.formats.OMEROMetadataStoreClient.ping(OMEROMetadataStoreClient.java:845)
02:09:59 	at ome.formats.importer.util.ClientKeepAlive.run(ClientKeepAlive.java:77)
02:09:59 	at java.base/java.util.concurrent.Executors$RunnableAdapter.call(Executors.java:515)
02:09:59 	at java.base/java.util.concurrent.FutureTask.runAndReset(FutureTask.java:305)
02:09:59 	at java.base/java.util.concurrent.ScheduledThreadPoolExecutor$ScheduledFutureTask.run(ScheduledThreadPoolExecutor.java:305)
02:09:59 	at java.base/java.util.concurrent.ThreadPoolExecutor.runWorker(ThreadPoolExecutor.java:1128)
02:09:59 	at java.base/java.util.concurrent.ThreadPoolExecutor$Worker.run(ThreadPoolExecutor.java:628)
02:09:59 	at java.base/java.lang.Thread.run(Thread.java:829)
02:09:59 Caused by: Ice.CommunicatorDestroyedException: null
02:09:59 	at IceInternal.Instance.proxyFactory(Instance.java:239)
02:09:59 	at IceInternal.BasicStream.writeProxy(BasicStream.java:2142)
02:09:59 	at omero.api.ServiceInterfacePrxHelper.__write(ServiceInterfacePrxHelper.java:114)
02:09:59 	at omero.api.ServiceListHelper.write(ServiceListHelper.java:37)
02:09:59 	at omero.api.ServiceFactoryPrxHelper.begin_keepAllAlive(ServiceFactoryPrxHelper.java:5946)
02:09:59 	at omero.api.ServiceFactoryPrxHelper.keepAllAlive(ServiceFactoryPrxHelper.java:5846)
02:09:59 	at omero.api.ServiceFactoryPrxHelper.keepAllAlive(ServiceFactoryPrxHelper.java:5833)
02:09:59 	at ome.formats.OMEROMetadataStoreClient.ping(OMEROMetadataStoreClient.java:838)
02:09:59 	... 7 common frames omitted
02:09:59 2025-02-22 02:09:59,986 ERROR [ o.formats.importer.util.ClientKeepAlive] (1-thread-1) Exception while executing ping(), logging Connector out: 
02:09:59 java.lang.RuntimeException: Ice.CommunicatorDestroyedException
02:09:59 	at ome.formats.OMEROMetadataStoreClient.ping(OMEROMetadataStoreClient.java:845)
02:09:59 	at ome.formats.importer.util.ClientKeepAlive.run(ClientKeepAlive.java:77)
02:09:59 	at java.base/java.util.concurrent.Executors$RunnableAdapter.call(Executors.java:515)
02:09:59 	at java.base/java.util.concurrent.FutureTask.runAndReset(FutureTask.java:305)
02:09:59 	at java.base/java.util.concurrent.ScheduledThreadPoolExecutor$ScheduledFutureTask.run(ScheduledThreadPoolExecutor.java:305)
02:09:59 	at java.base/java.util.concurrent.ThreadPoolExecutor.runWorker(ThreadPoolExecutor.java:1128)
02:09:59 	at java.base/java.util.concurrent.ThreadPoolExecutor$Worker.run(ThreadPoolExecutor.java:628)
02:09:59 	at java.base/java.lang.Thread.run(Thread.java:829)
02:09:59 Caused by: Ice.CommunicatorDestroyedException: null
02:09:59 	at IceInternal.Instance.proxyFactory(Instance.java:239)
02:09:59 	at IceInternal.BasicStream.writeProxy(BasicStream.java:2142)
02:09:59 	at omero.api.ServiceInterfacePrxHelper.__write(ServiceInterfacePrxHelper.java:114)
02:09:59 	at omero.api.ServiceListHelper.write(ServiceListHelper.java:37)
02:09:59 	at omero.api.ServiceFactoryPrxHelper.begin_keepAllAlive(ServiceFactoryPrxHelper.java:5946)
02:09:59 	at omero.api.ServiceFactoryPrxHelper.keepAllAlive(ServiceFactoryPrxHelper.java:5846)
02:09:59 	at omero.api.ServiceFactoryPrxHelper.keepAllAlive(ServiceFactoryPrxHelper.java:5833)
02:09:59 	at ome.formats.OMEROMetadataStoreClient.ping(OMEROMetadataStoreClient.java:838)
02:09:59 	... 7 common frames omitted
02:10:06 2025-02-22 02:10:06,377 ERROR [ o.formats.importer.util.ClientKeepAlive] (3-thread-1) Exception while executing ping(), logging Connector out: 
02:10:06 java.lang.RuntimeException: Ice.CommunicatorDestroyedException
02:10:06 	at ome.formats.OMEROMetadataStoreClient.ping(OMEROMetadataStoreClient.java:845)
02:10:06 	at ome.formats.importer.util.ClientKeepAlive.run(ClientKeepAlive.java:77)
02:10:06 	at java.base/java.util.concurrent.Executors$RunnableAdapter.call(Executors.java:515)
02:10:06 	at java.base/java.util.concurrent.FutureTask.runAndReset(FutureTask.java:305)
02:10:06 	at java.base/java.util.concurrent.ScheduledThreadPoolExecutor$ScheduledFutureTask.run(ScheduledThreadPoolExecutor.java:305)
02:10:06 	at java.base/java.util.concurrent.ThreadPoolExecutor.runWorker(ThreadPoolExecutor.java:1128)
02:10:06 	at java.base/java.util.concurrent.ThreadPoolExecutor$Worker.run(ThreadPoolExecutor.java:628)
02:10:06 	at java.base/java.lang.Thread.run(Thread.java:829)
02:10:06 Caused by: Ice.CommunicatorDestroyedException: null
02:10:06 	at IceInternal.Instance.proxyFactory(Instance.java:239)
02:10:06 	at IceInternal.BasicStream.writeProxy(BasicStream.java:2142)
02:10:06 	at omero.api.ServiceInterfacePrxHelper.__write(ServiceInterfacePrxHelper.java:114)
02:10:06 	at omero.api.ServiceListHelper.write(ServiceListHelper.java:37)
02:10:06 	at omero.api.ServiceFactoryPrxHelper.begin_keepAllAlive(ServiceFactoryPrxHelper.java:5946)
02:10:06 	at omero.api.ServiceFactoryPrxHelper.keepAllAlive(ServiceFactoryPrxHelper.java:5846)
02:10:06 	at omero.api.ServiceFactoryPrxHelper.keepAllAlive(ServiceFactoryPrxHelper.java:5833)
02:10:06 	at ome.formats.OMEROMetadataStoreClient.ping(OMEROMetadataStoreClient.java:838)
02:10:06 	... 7 common frames omitted
02:10:07 2025-02-22 02:10:07,313 ERROR [ o.formats.importer.util.ClientKeepAlive] (4-thread-1) Exception while executing ping(), logging Connector out: 
02:10:07 java.lang.RuntimeException: Ice.CommunicatorDestroyedException
02:10:07 	at ome.formats.OMEROMetadataStoreClient.ping(OMEROMetadataStoreClient.java:845)
02:10:07 	at ome.formats.importer.util.ClientKeepAlive.run(ClientKeepAlive.java:77)
02:10:07 	at java.base/java.util.concurrent.Executors$RunnableAdapter.call(Executors.java:515)
02:10:07 	at java.base/java.util.concurrent.FutureTask.runAndReset(FutureTask.java:305)
02:10:07 	at java.base/java.util.concurrent.ScheduledThreadPoolExecutor$ScheduledFutureTask.run(ScheduledThreadPoolExecutor.java:305)
02:10:07 	at java.base/java.util.concurrent.ThreadPoolExecutor.runWorker(ThreadPoolExecutor.java:1128)
02:10:07 	at java.base/java.util.concurrent.ThreadPoolExecutor$Worker.run(ThreadPoolExecutor.java:628)
02:10:07 	at java.base/java.lang.Thread.run(Thread.java:829)
02:10:07 Caused by: Ice.CommunicatorDestroyedException: null
02:10:07 	at IceInternal.Instance.proxyFactory(Instance.java:239)
02:10:07 	at IceInternal.BasicStream.writeProxy(BasicStream.java:2142)
02:10:07 	at omero.api.ServiceInterfacePrxHelper.__write(ServiceInterfacePrxHelper.java:114)
02:10:07 	at omero.api.ServiceListHelper.write(ServiceListHelper.java:37)
02:10:07 	at omero.api.ServiceFactoryPrxHelper.begin_keepAllAlive(ServiceFactoryPrxHelper.java:5946)
02:10:07 	at omero.api.ServiceFactoryPrxHelper.keepAllAlive(ServiceFactoryPrxHelper.java:5846)
02:10:07 	at omero.api.ServiceFactoryPrxHelper.keepAllAlive(ServiceFactoryPrxHelper.java:5833)
02:10:07 	at ome.formats.OMEROMetadataStoreClient.ping(OMEROMetadataStoreClient.java:838)
02:10:07 	... 7 common frames omitted
02:10:10 2025-02-22 02:10:10,630 ERROR [ o.formats.importer.util.ClientKeepAlive] (6-thread-1) Exception while executing ping(), logging Connector out: 
02:10:10 java.lang.RuntimeException: Ice.CommunicatorDestroyedException
02:10:10 	at ome.formats.OMEROMetadataStoreClient.ping(OMEROMetadataStoreClient.java:845)
02:10:10 	at ome.formats.importer.util.ClientKeepAlive.run(ClientKeepAlive.java:77)
02:10:10 	at java.base/java.util.concurrent.Executors$RunnableAdapter.call(Executors.java:515)
02:10:10 	at java.base/java.util.concurrent.FutureTask.runAndReset(FutureTask.java:305)
02:10:10 	at java.base/java.util.concurrent.ScheduledThreadPoolExecutor$ScheduledFutureTask.run(ScheduledThreadPoolExecutor.java:305)
02:10:10 	at java.base/java.util.concurrent.ThreadPoolExecutor.runWorker(ThreadPoolExecutor.java:1128)
02:10:10 	at java.base/java.util.concurrent.ThreadPoolExecutor$Worker.run(ThreadPoolExecutor.java:628)
02:10:10 	at java.base/java.lang.Thread.run(Thread.java:829)
02:10:10 Caused by: Ice.CommunicatorDestroyedException: null
02:10:10 	at IceInternal.Instance.proxyFactory(Instance.java:239)
02:10:10 	at IceInternal.BasicStream.writeProxy(BasicStream.java:2142)
02:10:10 	at omero.api.ServiceInterfacePrxHelper.__write(ServiceInterfacePrxHelper.java:114)
02:10:10 	at omero.api.ServiceListHelper.write(ServiceListHelper.java:37)
02:10:10 	at omero.api.ServiceFactoryPrxHelper.begin_keepAllAlive(ServiceFactoryPrxHelper.java:5946)
02:10:10 	at omero.api.ServiceFactoryPrxHelper.keepAllAlive(ServiceFactoryPrxHelper.java:5846)
02:10:10 	at omero.api.ServiceFactoryPrxHelper.keepAllAlive(ServiceFactoryPrxHelper.java:5833)
02:10:10 	at ome.formats.OMEROMetadataStoreClient.ping(OMEROMetadataStoreClient.java:838)
02:10:10 	... 7 common frames omitted
02:10:11 2025-02-22 02:10:11,522 ERROR [ o.formats.importer.util.ClientKeepAlive] (7-thread-1) Exception while executing ping(), logging Connector out: 
02:10:11 java.lang.RuntimeException: Ice.CommunicatorDestroyedException
02:10:11 	at ome.formats.OMEROMetadataStoreClient.ping(OMEROMetadataStoreClient.java:845)
02:10:11 	at ome.formats.importer.util.ClientKeepAlive.run(ClientKeepAlive.java:77)
02:10:11 	at java.base/java.util.concurrent.Executors$RunnableAdapter.call(Executors.java:515)
02:10:11 	at java.base/java.util.concurrent.FutureTask.runAndReset(FutureTask.java:305)
02:10:11 	at java.base/java.util.concurrent.ScheduledThreadPoolExecutor$ScheduledFutureTask.run(ScheduledThreadPoolExecutor.java:305)
02:10:11 	at java.base/java.util.concurrent.ThreadPoolExecutor.runWorker(ThreadPoolExecutor.java:1128)
02:10:11 	at java.base/java.util.concurrent.ThreadPoolExecutor$Worker.run(ThreadPoolExecutor.java:628)
02:10:11 	at java.base/java.lang.Thread.run(Thread.java:829)
02:10:11 Caused by: Ice.CommunicatorDestroyedException: null
02:10:11 	at IceInternal.Instance.proxyFactory(Instance.java:239)
02:10:11 	at IceInternal.BasicStream.writeProxy(BasicStream.java:2142)
02:10:11 	at omero.api.ServiceInterfacePrxHelper.__write(ServiceInterfacePrxHelper.java:114)
02:10:11 	at omero.api.ServiceListHelper.write(ServiceListHelper.java:37)
02:10:11 	at omero.api.ServiceFactoryPrxHelper.begin_keepAllAlive(ServiceFactoryPrxHelper.java:5946)
02:10:11 	at omero.api.ServiceFactoryPrxHelper.keepAllAlive(ServiceFactoryPrxHelper.java:5846)
02:10:11 	at omero.api.ServiceFactoryPrxHelper.keepAllAlive(ServiceFactoryPrxHelper.java:5833)
02:10:11 	at ome.formats.OMEROMetadataStoreClient.ping(OMEROMetadataStoreClient.java:838)
02:10:11 	... 7 common frames omitted
02:10:14 2025-02-22 02:10:14,935 ERROR [ o.formats.importer.util.ClientKeepAlive] (9-thread-1) Exception while executing ping(), logging Connector out: 
02:10:14 java.lang.RuntimeException: Ice.CommunicatorDestroyedException
02:10:14 	at ome.formats.OMEROMetadataStoreClient.ping(OMEROMetadataStoreClient.java:845)
02:10:14 	at ome.formats.importer.util.ClientKeepAlive.run(ClientKeepAlive.java:77)
02:10:14 	at java.base/java.util.concurrent.Executors$RunnableAdapter.call(Executors.java:515)
02:10:14 	at java.base/java.util.concurrent.FutureTask.runAndReset(FutureTask.java:305)
02:10:14 	at java.base/java.util.concurrent.ScheduledThreadPoolExecutor$ScheduledFutureTask.run(ScheduledThreadPoolExecutor.java:305)
02:10:14 	at java.base/java.util.concurrent.ThreadPoolExecutor.runWorker(ThreadPoolExecutor.java:1128)
02:10:14 	at java.base/java.util.concurrent.ThreadPoolExecutor$Worker.run(ThreadPoolExecutor.java:628)
02:10:14 	at java.base/java.lang.Thread.run(Thread.java:829)
02:10:14 Caused by: Ice.CommunicatorDestroyedException: null
02:10:14 	at IceInternal.Instance.proxyFactory(Instance.java:239)
02:10:14 	at IceInternal.BasicStream.writeProxy(BasicStream.java:2142)
02:10:14 	at omero.api.ServiceInterfacePrxHelper.__write(ServiceInterfacePrxHelper.java:114)
02:10:14 	at omero.api.ServiceListHelper.write(ServiceListHelper.java:37)
02:10:14 	at omero.api.ServiceFactoryPrxHelper.begin_keepAllAlive(ServiceFactoryPrxHelper.java:5946)
02:10:14 	at omero.api.ServiceFactoryPrxHelper.keepAllAlive(ServiceFactoryPrxHelper.java:5846)
02:10:14 	at omero.api.ServiceFactoryPrxHelper.keepAllAlive(ServiceFactoryPrxHelper.java:5833)
02:10:14 	at ome.formats.OMEROMetadataStoreClient.ping(OMEROMetadataStoreClient.java:838)
02:10:14 	... 7 common frames omitted
02:10:15 2025-02-22 02:10:15,870 ERROR [ o.formats.importer.util.ClientKeepAlive] (0-thread-1) Exception while executing ping(), logging Connector out: 
02:10:15 java.lang.RuntimeException: Ice.CommunicatorDestroyedException
02:10:15 	at ome.formats.OMEROMetadataStoreClient.ping(OMEROMetadataStoreClient.java:845)
02:10:15 	at ome.formats.importer.util.ClientKeepAlive.run(ClientKeepAlive.java:77)
02:10:15 	at java.base/java.util.concurrent.Executors$RunnableAdapter.call(Executors.java:515)
02:10:15 	at java.base/java.util.concurrent.FutureTask.runAndReset(FutureTask.java:305)
02:10:15 	at java.base/java.util.concurrent.ScheduledThreadPoolExecutor$ScheduledFutureTask.run(ScheduledThreadPoolExecutor.java:305)
02:10:15 	at java.base/java.util.concurrent.ThreadPoolExecutor.runWorker(ThreadPoolExecutor.java:1128)
02:10:15 	at java.base/java.util.concurrent.ThreadPoolExecutor$Worker.run(ThreadPoolExecutor.java:628)
02:10:15 	at java.base/java.lang.Thread.run(Thread.java:829)
02:10:15 Caused by: Ice.CommunicatorDestroyedException: null
02:10:15 	at IceInternal.Instance.proxyFactory(Instance.java:239)
02:10:15 	at IceInternal.BasicStream.writeProxy(BasicStream.java:2142)
02:10:15 	at omero.api.ServiceInterfacePrxHelper.__write(ServiceInterfacePrxHelper.java:114)
02:10:15 	at omero.api.ServiceListHelper.write(ServiceListHelper.java:37)
02:10:15 	at omero.api.ServiceFactoryPrxHelper.begin_keepAllAlive(ServiceFactoryPrxHelper.java:5946)
02:10:15 	at omero.api.ServiceFactoryPrxHelper.keepAllAlive(ServiceFactoryPrxHelper.java:5846)
02:10:15 	at omero.api.ServiceFactoryPrxHelper.keepAllAlive(ServiceFactoryPrxHelper.java:5833)
02:10:15 	at ome.formats.OMEROMetadataStoreClient.ping(OMEROMetadataStoreClient.java:838)
02:10:15 	... 7 common frames omitted
02:10:23 2025-02-22 02:10:23,384 ERROR [ o.formats.importer.util.ClientKeepAlive] (2-thread-1) Exception while executing ping(), logging Connector out: 
02:10:23 java.lang.RuntimeException: Ice.CommunicatorDestroyedException
02:10:23 	at ome.formats.OMEROMetadataStoreClient.ping(OMEROMetadataStoreClient.java:845)
02:10:23 	at ome.formats.importer.util.ClientKeepAlive.run(ClientKeepAlive.java:77)
02:10:23 	at java.base/java.util.concurrent.Executors$RunnableAdapter.call(Executors.java:515)
02:10:23 	at java.base/java.util.concurrent.FutureTask.runAndReset(FutureTask.java:305)
02:10:23 	at java.base/java.util.concurrent.ScheduledThreadPoolExecutor$ScheduledFutureTask.run(ScheduledThreadPoolExecutor.java:305)
02:10:23 	at java.base/java.util.concurrent.ThreadPoolExecutor.runWorker(ThreadPoolExecutor.java:1128)
02:10:23 	at java.base/java.util.concurrent.ThreadPoolExecutor$Worker.run(ThreadPoolExecutor.java:628)
02:10:23 	at java.base/java.lang.Thread.run(Thread.java:829)
02:10:23 Caused by: Ice.CommunicatorDestroyedException: null
02:10:23 	at IceInternal.Instance.proxyFactory(Instance.java:239)
02:10:23 	at IceInternal.BasicStream.writeProxy(BasicStream.java:2142)
02:10:23 	at omero.api.ServiceInterfacePrxHelper.__write(ServiceInterfacePrxHelper.java:114)
02:10:23 	at omero.api.ServiceListHelper.write(ServiceListHelper.java:37)
02:10:23 	at omero.api.ServiceFactoryPrxHelper.begin_keepAllAlive(ServiceFactoryPrxHelper.java:5946)
02:10:23 	at omero.api.ServiceFactoryPrxHelper.keepAllAlive(ServiceFactoryPrxHelper.java:5846)
02:10:23 	at omero.api.ServiceFactoryPrxHelper.keepAllAlive(ServiceFactoryPrxHelper.java:5833)
02:10:23 	at ome.formats.OMEROMetadataStoreClient.ping(OMEROMetadataStoreClient.java:838)
02:10:23 	... 7 common frames omitted
02:10:24 2025-02-22 02:10:24,266 ERROR [ o.formats.importer.util.ClientKeepAlive] (3-thread-1) Exception while executing ping(), logging Connector out: 
02:10:24 java.lang.RuntimeException: Ice.CommunicatorDestroyedException
02:10:24 	at ome.formats.OMEROMetadataStoreClient.ping(OMEROMetadataStoreClient.java:845)
02:10:24 	at ome.formats.importer.util.ClientKeepAlive.run(ClientKeepAlive.java:77)
02:10:24 	at java.base/java.util.concurrent.Executors$RunnableAdapter.call(Executors.java:515)
02:10:24 	at java.base/java.util.concurrent.FutureTask.runAndReset(FutureTask.java:305)
02:10:24 	at java.base/java.util.concurrent.ScheduledThreadPoolExecutor$ScheduledFutureTask.run(ScheduledThreadPoolExecutor.java:305)
02:10:24 	at java.base/java.util.concurrent.ThreadPoolExecutor.runWorker(ThreadPoolExecutor.java:1128)
02:10:24 	at java.base/java.util.concurrent.ThreadPoolExecutor$Worker.run(ThreadPoolExecutor.java:628)
02:10:24 	at java.base/java.lang.Thread.run(Thread.java:829)
02:10:24 Caused by: Ice.CommunicatorDestroyedException: null
02:10:24 	at IceInternal.Instance.proxyFactory(Instance.java:239)
02:10:24 	at IceInternal.BasicStream.writeProxy(BasicStream.java:2142)
02:10:24 	at omero.api.ServiceInterfacePrxHelper.__write(ServiceInterfacePrxHelper.java:114)
02:10:24 	at omero.api.ServiceListHelper.write(ServiceListHelper.java:37)
02:10:24 	at omero.api.ServiceFactoryPrxHelper.begin_keepAllAlive(ServiceFactoryPrxHelper.java:5946)
02:10:24 	at omero.api.ServiceFactoryPrxHelper.keepAllAlive(ServiceFactoryPrxHelper.java:5846)
02:10:24 	at omero.api.ServiceFactoryPrxHelper.keepAllAlive(ServiceFactoryPrxHelper.java:5833)
02:10:24 	at ome.formats.OMEROMetadataStoreClient.ping(OMEROMetadataStoreClient.java:838)
02:10:24 	... 7 common frames omitted
02:10:30 2025-02-22 02:10:30,888 ERROR [ o.formats.importer.util.ClientKeepAlive] (5-thread-1) Exception while executing ping(), logging Connector out: 
02:10:30 java.lang.RuntimeException: Ice.CommunicatorDestroyedException
02:10:30 	at ome.formats.OMEROMetadataStoreClient.ping(OMEROMetadataStoreClient.java:845)
02:10:30 	at ome.formats.importer.util.ClientKeepAlive.run(ClientKeepAlive.java:77)
02:10:30 	at java.base/java.util.concurrent.Executors$RunnableAdapter.call(Executors.java:515)
02:10:30 	at java.base/java.util.concurrent.FutureTask.runAndReset(FutureTask.java:305)
02:10:30 	at java.base/java.util.concurrent.ScheduledThreadPoolExecutor$ScheduledFutureTask.run(ScheduledThreadPoolExecutor.java:305)
02:10:30 	at java.base/java.util.concurrent.ThreadPoolExecutor.runWorker(ThreadPoolExecutor.java:1128)
02:10:30 	at java.base/java.util.concurrent.ThreadPoolExecutor$Worker.run(ThreadPoolExecutor.java:628)
02:10:30 	at java.base/java.lang.Thread.run(Thread.java:829)
02:10:30 Caused by: Ice.CommunicatorDestroyedException: null
02:10:30 	at IceInternal.Instance.proxyFactory(Instance.java:239)
02:10:30 	at IceInternal.BasicStream.writeProxy(BasicStream.java:2142)
02:10:30 	at omero.api.ServiceInterfacePrxHelper.__write(ServiceInterfacePrxHelper.java:114)
02:10:30 	at omero.api.ServiceListHelper.write(ServiceListHelper.java:37)
02:10:30 	at omero.api.ServiceFactoryPrxHelper.begin_keepAllAlive(ServiceFactoryPrxHelper.java:5946)
02:10:30 	at omero.api.ServiceFactoryPrxHelper.keepAllAlive(ServiceFactoryPrxHelper.java:5846)
02:10:30 	at omero.api.ServiceFactoryPrxHelper.keepAllAlive(ServiceFactoryPrxHelper.java:5833)
02:10:30 	at ome.formats.OMEROMetadataStoreClient.ping(OMEROMetadataStoreClient.java:838)
02:10:30 	... 7 common frames omitted
02:10:31 2025-02-22 02:10:31,802 ERROR [ o.formats.importer.util.ClientKeepAlive] (6-thread-1) Exception while executing ping(), logging Connector out: 
02:10:31 java.lang.RuntimeException: Ice.CommunicatorDestroyedException
02:10:31 	at ome.formats.OMEROMetadataStoreClient.ping(OMEROMetadataStoreClient.java:845)
02:10:31 	at ome.formats.importer.util.ClientKeepAlive.run(ClientKeepAlive.java:77)
02:10:31 	at java.base/java.util.concurrent.Executors$RunnableAdapter.call(Executors.java:515)
02:10:31 	at java.base/java.util.concurrent.FutureTask.runAndReset(FutureTask.java:305)
02:10:31 	at java.base/java.util.concurrent.ScheduledThreadPoolExecutor$ScheduledFutureTask.run(ScheduledThreadPoolExecutor.java:305)
02:10:31 	at java.base/java.util.concurrent.ThreadPoolExecutor.runWorker(ThreadPoolExecutor.java:1128)
02:10:31 	at java.base/java.util.concurrent.ThreadPoolExecutor$Worker.run(ThreadPoolExecutor.java:628)
02:10:31 	at java.base/java.lang.Thread.run(Thread.java:829)
02:10:31 Caused by: Ice.CommunicatorDestroyedException: null
02:10:31 	at IceInternal.Instance.proxyFactory(Instance.java:239)
02:10:31 	at IceInternal.BasicStream.writeProxy(BasicStream.java:2142)
02:10:31 	at omero.api.ServiceInterfacePrxHelper.__write(ServiceInterfacePrxHelper.java:114)
02:10:31 	at omero.api.ServiceListHelper.write(ServiceListHelper.java:37)
02:10:31 	at omero.api.ServiceFactoryPrxHelper.begin_keepAllAlive(ServiceFactoryPrxHelper.java:5946)
02:10:31 	at omero.api.ServiceFactoryPrxHelper.keepAllAlive(ServiceFactoryPrxHelper.java:5846)
02:10:31 	at omero.api.ServiceFactoryPrxHelper.keepAllAlive(ServiceFactoryPrxHelper.java:5833)
02:10:31 	at ome.formats.OMEROMetadataStoreClient.ping(OMEROMetadataStoreClient.java:838)
02:10:31 	... 7 common frames omitted
02:10:39 2025-02-22 02:10:39,360 ERROR [ o.formats.importer.util.ClientKeepAlive] (8-thread-1) Exception while executing ping(), logging Connector out: 
02:10:39 java.lang.RuntimeException: Ice.CommunicatorDestroyedException
02:10:39 	at ome.formats.OMEROMetadataStoreClient.ping(OMEROMetadataStoreClient.java:845)
02:10:39 	at ome.formats.importer.util.ClientKeepAlive.run(ClientKeepAlive.java:77)
02:10:39 	at java.base/java.util.concurrent.Executors$RunnableAdapter.call(Executors.java:515)
02:10:39 	at java.base/java.util.concurrent.FutureTask.runAndReset(FutureTask.java:305)
02:10:39 	at java.base/java.util.concurrent.ScheduledThreadPoolExecutor$ScheduledFutureTask.run(ScheduledThreadPoolExecutor.java:305)
02:10:39 	at java.base/java.util.concurrent.ThreadPoolExecutor.runWorker(ThreadPoolExecutor.java:1128)
02:10:39 	at java.base/java.util.concurrent.ThreadPoolExecutor$Worker.run(ThreadPoolExecutor.java:628)
02:10:39 	at java.base/java.lang.Thread.run(Thread.java:829)
02:10:39 Caused by: Ice.CommunicatorDestroyedException: null
02:10:39 	at IceInternal.Instance.proxyFactory(Instance.java:239)
02:10:39 	at IceInternal.BasicStream.writeProxy(BasicStream.java:2142)
02:10:39 	at omero.api.ServiceInterfacePrxHelper.__write(ServiceInterfacePrxHelper.java:114)
02:10:39 	at omero.api.ServiceListHelper.write(ServiceListHelper.java:37)
02:10:39 	at omero.api.ServiceFactoryPrxHelper.begin_keepAllAlive(ServiceFactoryPrxHelper.java:5946)
02:10:39 	at omero.api.ServiceFactoryPrxHelper.keepAllAlive(ServiceFactoryPrxHelper.java:5846)
02:10:39 	at omero.api.ServiceFactoryPrxHelper.keepAllAlive(ServiceFactoryPrxHelper.java:5833)
02:10:39 	at ome.formats.OMEROMetadataStoreClient.ping(OMEROMetadataStoreClient.java:838)
02:10:39 	... 7 common frames omitted
02:10:40 2025-02-22 02:10:40,255 ERROR [ o.formats.importer.util.ClientKeepAlive] (9-thread-1) Exception while executing ping(), logging Connector out: 
02:10:40 java.lang.RuntimeException: Ice.CommunicatorDestroyedException
02:10:40 	at ome.formats.OMEROMetadataStoreClient.ping(OMEROMetadataStoreClient.java:845)
02:10:40 	at ome.formats.importer.util.ClientKeepAlive.run(ClientKeepAlive.java:77)
02:10:40 	at java.base/java.util.concurrent.Executors$RunnableAdapter.call(Executors.java:515)
02:10:40 	at java.base/java.util.concurrent.FutureTask.runAndReset(FutureTask.java:305)
02:10:40 	at java.base/java.util.concurrent.ScheduledThreadPoolExecutor$ScheduledFutureTask.run(ScheduledThreadPoolExecutor.java:305)
02:10:40 	at java.base/java.util.concurrent.ThreadPoolExecutor.runWorker(ThreadPoolExecutor.java:1128)
02:10:40 	at java.base/java.util.concurrent.ThreadPoolExecutor$Worker.run(ThreadPoolExecutor.java:628)
02:10:40 	at java.base/java.lang.Thread.run(Thread.java:829)
02:10:40 Caused by: Ice.CommunicatorDestroyedException: null
02:10:40 	at IceInternal.Instance.proxyFactory(Instance.java:239)
02:10:40 	at IceInternal.BasicStream.writeProxy(BasicStream.java:2142)
02:10:40 	at omero.api.ServiceInterfacePrxHelper.__write(ServiceInterfacePrxHelper.java:114)
02:10:40 	at omero.api.ServiceListHelper.write(ServiceListHelper.java:37)
02:10:40 	at omero.api.ServiceFactoryPrxHelper.begin_keepAllAlive(ServiceFactoryPrxHelper.java:5946)
02:10:40 	at omero.api.ServiceFactoryPrxHelper.keepAllAlive(ServiceFactoryPrxHelper.java:5846)
02:10:40 	at omero.api.ServiceFactoryPrxHelper.keepAllAlive(ServiceFactoryPrxHelper.java:5833)
02:10:40 	at ome.formats.OMEROMetadataStoreClient.ping(OMEROMetadataStoreClient.java:838)
02:10:40 	... 7 common frames omitted
02:10:46 2025-02-22 02:10:46,962 ERROR [ o.formats.importer.util.ClientKeepAlive] (1-thread-1) Exception while executing ping(), logging Connector out: 
02:10:46 java.lang.RuntimeException: Ice.CommunicatorDestroyedException
02:10:46 	at ome.formats.OMEROMetadataStoreClient.ping(OMEROMetadataStoreClient.java:845)
02:10:46 	at ome.formats.importer.util.ClientKeepAlive.run(ClientKeepAlive.java:77)
02:10:46 	at java.base/java.util.concurrent.Executors$RunnableAdapter.call(Executors.java:515)
02:10:46 	at java.base/java.util.concurrent.FutureTask.runAndReset(FutureTask.java:305)
02:10:46 	at java.base/java.util.concurrent.ScheduledThreadPoolExecutor$ScheduledFutureTask.run(ScheduledThreadPoolExecutor.java:305)
02:10:46 	at java.base/java.util.concurrent.ThreadPoolExecutor.runWorker(ThreadPoolExecutor.java:1128)
02:10:46 	at java.base/java.util.concurrent.ThreadPoolExecutor$Worker.run(ThreadPoolExecutor.java:628)
02:10:46 	at java.base/java.lang.Thread.run(Thread.java:829)
02:10:46 Caused by: Ice.CommunicatorDestroyedException: null
02:10:46 	at IceInternal.Instance.proxyFactory(Instance.java:239)
02:10:46 	at IceInternal.BasicStream.writeProxy(BasicStream.java:2142)
02:10:46 	at omero.api.ServiceInterfacePrxHelper.__write(ServiceInterfacePrxHelper.java:114)
02:10:46 	at omero.api.ServiceListHelper.write(ServiceListHelper.java:37)
02:10:46 	at omero.api.ServiceFactoryPrxHelper.begin_keepAllAlive(ServiceFactoryPrxHelper.java:5946)
02:10:46 	at omero.api.ServiceFactoryPrxHelper.keepAllAlive(ServiceFactoryPrxHelper.java:5846)
02:10:46 	at omero.api.ServiceFactoryPrxHelper.keepAllAlive(ServiceFactoryPrxHelper.java:5833)
02:10:46 	at ome.formats.OMEROMetadataStoreClient.ping(OMEROMetadataStoreClient.java:838)
02:10:46 	... 7 common frames omitted
02:10:47 2025-02-22 02:10:47,920 ERROR [ o.formats.importer.util.ClientKeepAlive] (2-thread-1) Exception while executing ping(), logging Connector out: 
02:10:47 java.lang.RuntimeException: Ice.CommunicatorDestroyedException
02:10:47 	at ome.formats.OMEROMetadataStoreClient.ping(OMEROMetadataStoreClient.java:845)
02:10:47 	at ome.formats.importer.util.ClientKeepAlive.run(ClientKeepAlive.java:77)
02:10:47 	at java.base/java.util.concurrent.Executors$RunnableAdapter.call(Executors.java:515)
02:10:47 	at java.base/java.util.concurrent.FutureTask.runAndReset(FutureTask.java:305)
02:10:47 	at java.base/java.util.concurrent.ScheduledThreadPoolExecutor$ScheduledFutureTask.run(ScheduledThreadPoolExecutor.java:305)
02:10:47 	at java.base/java.util.concurrent.ThreadPoolExecutor.runWorker(ThreadPoolExecutor.java:1128)
02:10:47 	at java.base/java.util.concurrent.ThreadPoolExecutor$Worker.run(ThreadPoolExecutor.java:628)
02:10:47 	at java.base/java.lang.Thread.run(Thread.java:829)
02:10:47 Caused by: Ice.CommunicatorDestroyedException: null
02:10:47 	at IceInternal.Instance.proxyFactory(Instance.java:239)
02:10:47 	at IceInternal.BasicStream.writeProxy(BasicStream.java:2142)
02:10:47 	at omero.api.ServiceInterfacePrxHelper.__write(ServiceInterfacePrxHelper.java:114)
02:10:47 	at omero.api.ServiceListHelper.write(ServiceListHelper.java:37)
02:10:47 	at omero.api.ServiceFactoryPrxHelper.begin_keepAllAlive(ServiceFactoryPrxHelper.java:5946)
02:10:47 	at omero.api.ServiceFactoryPrxHelper.keepAllAlive(ServiceFactoryPrxHelper.java:5846)
02:10:47 	at omero.api.ServiceFactoryPrxHelper.keepAllAlive(ServiceFactoryPrxHelper.java:5833)
02:10:47 	at ome.formats.OMEROMetadataStoreClient.ping(OMEROMetadataStoreClient.java:838)
02:10:47 	... 7 common frames omitted
02:10:54 2025-02-22 02:10:54,543 ERROR [ o.formats.importer.util.ClientKeepAlive] (4-thread-1) Exception while executing ping(), logging Connector out: 
02:10:54 java.lang.RuntimeException: Ice.CommunicatorDestroyedException
02:10:54 	at ome.formats.OMEROMetadataStoreClient.ping(OMEROMetadataStoreClient.java:845)
02:10:54 	at ome.formats.importer.util.ClientKeepAlive.run(ClientKeepAlive.java:77)
02:10:54 	at java.base/java.util.concurrent.Executors$RunnableAdapter.call(Executors.java:515)
02:10:54 	at java.base/java.util.concurrent.FutureTask.runAndReset(FutureTask.java:305)
02:10:54 	at java.base/java.util.concurrent.ScheduledThreadPoolExecutor$ScheduledFutureTask.run(ScheduledThreadPoolExecutor.java:305)
02:10:54 	at java.base/java.util.concurrent.ThreadPoolExecutor.runWorker(ThreadPoolExecutor.java:1128)
02:10:54 	at java.base/java.util.concurrent.ThreadPoolExecutor$Worker.run(ThreadPoolExecutor.java:628)
02:10:54 	at java.base/java.lang.Thread.run(Thread.java:829)
02:10:54 Caused by: Ice.CommunicatorDestroyedException: null
02:10:54 	at IceInternal.Instance.proxyFactory(Instance.java:239)
02:10:54 	at IceInternal.BasicStream.writeProxy(BasicStream.java:2142)
02:10:54 	at omero.api.ServiceInterfacePrxHelper.__write(ServiceInterfacePrxHelper.java:114)
02:10:54 	at omero.api.ServiceListHelper.write(ServiceListHelper.java:37)
02:10:54 	at omero.api.ServiceFactoryPrxHelper.begin_keepAllAlive(ServiceFactoryPrxHelper.java:5946)
02:10:54 	at omero.api.ServiceFactoryPrxHelper.keepAllAlive(ServiceFactoryPrxHelper.java:5846)
02:10:54 	at omero.api.ServiceFactoryPrxHelper.keepAllAlive(ServiceFactoryPrxHelper.java:5833)
02:10:54 	at ome.formats.OMEROMetadataStoreClient.ping(OMEROMetadataStoreClient.java:838)
02:10:54 	... 7 common frames omitted
02:10:55 2025-02-22 02:10:55,427 ERROR [ o.formats.importer.util.ClientKeepAlive] (5-thread-1) Exception while executing ping(), logging Connector out: 
02:10:55 java.lang.RuntimeException: Ice.CommunicatorDestroyedException
02:10:55 	at ome.formats.OMEROMetadataStoreClient.ping(OMEROMetadataStoreClient.java:845)
02:10:55 	at ome.formats.importer.util.ClientKeepAlive.run(ClientKeepAlive.java:77)
02:10:55 	at java.base/java.util.concurrent.Executors$RunnableAdapter.call(Executors.java:515)
02:10:55 	at java.base/java.util.concurrent.FutureTask.runAndReset(FutureTask.java:305)
02:10:55 	at java.base/java.util.concurrent.ScheduledThreadPoolExecutor$ScheduledFutureTask.run(ScheduledThreadPoolExecutor.java:305)
02:10:55 	at java.base/java.util.concurrent.ThreadPoolExecutor.runWorker(ThreadPoolExecutor.java:1128)
02:10:55 	at java.base/java.util.concurrent.ThreadPoolExecutor$Worker.run(ThreadPoolExecutor.java:628)
02:10:55 	at java.base/java.lang.Thread.run(Thread.java:829)
02:10:55 Caused by: Ice.CommunicatorDestroyedException: null
02:10:55 	at IceInternal.Instance.proxyFactory(Instance.java:239)
02:10:55 	at IceInternal.BasicStream.writeProxy(BasicStream.java:2142)
02:10:55 	at omero.api.ServiceInterfacePrxHelper.__write(ServiceInterfacePrxHelper.java:114)
02:10:55 	at omero.api.ServiceListHelper.write(ServiceListHelper.java:37)
02:10:55 	at omero.api.ServiceFactoryPrxHelper.begin_keepAllAlive(ServiceFactoryPrxHelper.java:5946)
02:10:55 	at omero.api.ServiceFactoryPrxHelper.keepAllAlive(ServiceFactoryPrxHelper.java:5846)
02:10:55 	at omero.api.ServiceFactoryPrxHelper.keepAllAlive(ServiceFactoryPrxHelper.java:5833)
02:10:55 	at ome.formats.OMEROMetadataStoreClient.ping(OMEROMetadataStoreClient.java:838)
02:10:55 	... 7 common frames omitted
02:10:59 2025-02-22 02:10:59,021 ERROR [ o.formats.importer.util.ClientKeepAlive] (7-thread-1) Exception while executing ping(), logging Connector out: 
02:10:59 java.lang.RuntimeException: Ice.CommunicatorDestroyedException
02:10:59 	at ome.formats.OMEROMetadataStoreClient.ping(OMEROMetadataStoreClient.java:845)
02:10:59 	at ome.formats.importer.util.ClientKeepAlive.run(ClientKeepAlive.java:77)
02:10:59 	at java.base/java.util.concurrent.Executors$RunnableAdapter.call(Executors.java:515)
02:10:59 	at java.base/java.util.concurrent.FutureTask.runAndReset(FutureTask.java:305)
02:10:59 	at java.base/java.util.concurrent.ScheduledThreadPoolExecutor$ScheduledFutureTask.run(ScheduledThreadPoolExecutor.java:305)
02:10:59 	at java.base/java.util.concurrent.ThreadPoolExecutor.runWorker(ThreadPoolExecutor.java:1128)
02:10:59 	at java.base/java.util.concurrent.ThreadPoolExecutor$Worker.run(ThreadPoolExecutor.java:628)
02:10:59 	at java.base/java.lang.Thread.run(Thread.java:829)
02:10:59 Caused by: Ice.CommunicatorDestroyedException: null
02:10:59 	at IceInternal.Instance.proxyFactory(Instance.java:239)
02:10:59 	at IceInternal.BasicStream.writeProxy(BasicStream.java:2142)
02:10:59 	at omero.api.ServiceInterfacePrxHelper.__write(ServiceInterfacePrxHelper.java:114)
02:10:59 	at omero.api.ServiceListHelper.write(ServiceListHelper.java:37)
02:10:59 	at omero.api.ServiceFactoryPrxHelper.begin_keepAllAlive(ServiceFactoryPrxHelper.java:5946)
02:10:59 	at omero.api.ServiceFactoryPrxHelper.keepAllAlive(ServiceFactoryPrxHelper.java:5846)
02:10:59 	at omero.api.ServiceFactoryPrxHelper.keepAllAlive(ServiceFactoryPrxHelper.java:5833)
02:10:59 	at ome.formats.OMEROMetadataStoreClient.ping(OMEROMetadataStoreClient.java:838)
02:10:59 	... 7 common frames omitted
02:10:59 2025-02-22 02:10:59,945 ERROR [ o.formats.importer.util.ClientKeepAlive] (8-thread-1) Exception while executing ping(), logging Connector out: 
02:10:59 java.lang.RuntimeException: Ice.CommunicatorDestroyedException
02:10:59 	at ome.formats.OMEROMetadataStoreClient.ping(OMEROMetadataStoreClient.java:845)
02:10:59 	at ome.formats.importer.util.ClientKeepAlive.run(ClientKeepAlive.java:77)
02:10:59 	at java.base/java.util.concurrent.Executors$RunnableAdapter.call(Executors.java:515)
02:10:59 	at java.base/java.util.concurrent.FutureTask.runAndReset(FutureTask.java:305)
02:10:59 	at java.base/java.util.concurrent.ScheduledThreadPoolExecutor$ScheduledFutureTask.run(ScheduledThreadPoolExecutor.java:305)
02:10:59 	at java.base/java.util.concurrent.ThreadPoolExecutor.runWorker(ThreadPoolExecutor.java:1128)
02:10:59 	at java.base/java.util.concurrent.ThreadPoolExecutor$Worker.run(ThreadPoolExecutor.java:628)
02:10:59 	at java.base/java.lang.Thread.run(Thread.java:829)
02:10:59 Caused by: Ice.CommunicatorDestroyedException: null
02:10:59 	at IceInternal.Instance.proxyFactory(Instance.java:239)
02:10:59 	at IceInternal.BasicStream.writeProxy(BasicStream.java:2142)
02:10:59 	at omero.api.ServiceInterfacePrxHelper.__write(ServiceInterfacePrxHelper.java:114)
02:10:59 	at omero.api.ServiceListHelper.write(ServiceListHelper.java:37)
02:10:59 	at omero.api.ServiceFactoryPrxHelper.begin_keepAllAlive(ServiceFactoryPrxHelper.java:5946)
02:10:59 	at omero.api.ServiceFactoryPrxHelper.keepAllAlive(ServiceFactoryPrxHelper.java:5846)
02:10:59 	at omero.api.ServiceFactoryPrxHelper.keepAllAlive(ServiceFactoryPrxHelper.java:5833)
02:10:59 	at ome.formats.OMEROMetadataStoreClient.ping(OMEROMetadataStoreClient.java:838)
02:10:59 	... 7 common frames omitted
02:11:07 2025-02-22 02:11:07,488 ERROR [ o.formats.importer.util.ClientKeepAlive] (0-thread-1) Exception while executing ping(), logging Connector out: 
02:11:07 java.lang.RuntimeException: Ice.CommunicatorDestroyedException
02:11:07 	at ome.formats.OMEROMetadataStoreClient.ping(OMEROMetadataStoreClient.java:845)
02:11:07 	at ome.formats.importer.util.ClientKeepAlive.run(ClientKeepAlive.java:77)
02:11:07 	at java.base/java.util.concurrent.Executors$RunnableAdapter.call(Executors.java:515)
02:11:07 	at java.base/java.util.concurrent.FutureTask.runAndReset(FutureTask.java:305)
02:11:07 	at java.base/java.util.concurrent.ScheduledThreadPoolExecutor$ScheduledFutureTask.run(ScheduledThreadPoolExecutor.java:305)
02:11:07 	at java.base/java.util.concurrent.ThreadPoolExecutor.runWorker(ThreadPoolExecutor.java:1128)
02:11:07 	at java.base/java.util.concurrent.ThreadPoolExecutor$Worker.run(ThreadPoolExecutor.java:628)
02:11:07 	at java.base/java.lang.Thread.run(Thread.java:829)
02:11:07 Caused by: Ice.CommunicatorDestroyedException: null
02:11:07 	at IceInternal.Instance.proxyFactory(Instance.java:239)
02:11:07 	at IceInternal.BasicStream.writeProxy(BasicStream.java:2142)
02:11:07 	at omero.api.ServiceInterfacePrxHelper.__write(ServiceInterfacePrxHelper.java:114)
02:11:07 	at omero.api.ServiceListHelper.write(ServiceListHelper.java:37)
02:11:07 	at omero.api.ServiceFactoryPrxHelper.begin_keepAllAlive(ServiceFactoryPrxHelper.java:5946)
02:11:07 	at omero.api.ServiceFactoryPrxHelper.keepAllAlive(ServiceFactoryPrxHelper.java:5846)
02:11:07 	at omero.api.ServiceFactoryPrxHelper.keepAllAlive(ServiceFactoryPrxHelper.java:5833)
02:11:07 	at ome.formats.OMEROMetadataStoreClient.ping(OMEROMetadataStoreClient.java:838)
02:11:07 	... 7 common frames omitted
02:11:08 2025-02-22 02:11:08,480 ERROR [ o.formats.importer.util.ClientKeepAlive] (1-thread-1) Exception while executing ping(), logging Connector out: 
02:11:08 java.lang.RuntimeException: Ice.CommunicatorDestroyedException
02:11:08 	at ome.formats.OMEROMetadataStoreClient.ping(OMEROMetadataStoreClient.java:845)
02:11:08 	at ome.formats.importer.util.ClientKeepAlive.run(ClientKeepAlive.java:77)
02:11:08 	at java.base/java.util.concurrent.Executors$RunnableAdapter.call(Executors.java:515)
02:11:08 	at java.base/java.util.concurrent.FutureTask.runAndReset(FutureTask.java:305)
02:11:08 	at java.base/java.util.concurrent.ScheduledThreadPoolExecutor$ScheduledFutureTask.run(ScheduledThreadPoolExecutor.java:305)
02:11:08 	at java.base/java.util.concurrent.ThreadPoolExecutor.runWorker(ThreadPoolExecutor.java:1128)
02:11:08 	at java.base/java.util.concurrent.ThreadPoolExecutor$Worker.run(ThreadPoolExecutor.java:628)
02:11:08 	at java.base/java.lang.Thread.run(Thread.java:829)
02:11:08 Caused by: Ice.CommunicatorDestroyedException: null
02:11:08 	at IceInternal.Instance.proxyFactory(Instance.java:239)
02:11:08 	at IceInternal.BasicStream.writeProxy(BasicStream.java:2142)
02:11:08 	at omero.api.ServiceInterfacePrxHelper.__write(ServiceInterfacePrxHelper.java:114)
02:11:08 	at omero.api.ServiceListHelper.write(ServiceListHelper.java:37)
02:11:08 	at omero.api.ServiceFactoryPrxHelper.begin_keepAllAlive(ServiceFactoryPrxHelper.java:5946)
02:11:08 	at omero.api.ServiceFactoryPrxHelper.keepAllAlive(ServiceFactoryPrxHelper.java:5846)
02:11:08 	at omero.api.ServiceFactoryPrxHelper.keepAllAlive(ServiceFactoryPrxHelper.java:5833)
02:11:08 	at ome.formats.OMEROMetadataStoreClient.ping(OMEROMetadataStoreClient.java:838)
02:11:08 	... 7 common frames omitted
02:11:15 2025-02-22 02:11:15,041 ERROR [ o.formats.importer.util.ClientKeepAlive] (3-thread-1) Exception while executing ping(), logging Connector out: 
02:11:15 java.lang.RuntimeException: Ice.CommunicatorDestroyedException
02:11:15 	at ome.formats.OMEROMetadataStoreClient.ping(OMEROMetadataStoreClient.java:845)
02:11:15 	at ome.formats.importer.util.ClientKeepAlive.run(ClientKeepAlive.java:77)
02:11:15 	at java.base/java.util.concurrent.Executors$RunnableAdapter.call(Executors.java:515)
02:11:15 	at java.base/java.util.concurrent.FutureTask.runAndReset(FutureTask.java:305)
02:11:15 	at java.base/java.util.concurrent.ScheduledThreadPoolExecutor$ScheduledFutureTask.run(ScheduledThreadPoolExecutor.java:305)
02:11:15 	at java.base/java.util.concurrent.ThreadPoolExecutor.runWorker(ThreadPoolExecutor.java:1128)
02:11:15 	at java.base/java.util.concurrent.ThreadPoolExecutor$Worker.run(ThreadPoolExecutor.java:628)
02:11:15 	at java.base/java.lang.Thread.run(Thread.java:829)
02:11:15 Caused by: Ice.CommunicatorDestroyedException: null
02:11:15 	at IceInternal.Instance.proxyFactory(Instance.java:239)
02:11:15 	at IceInternal.BasicStream.writeProxy(BasicStream.java:2142)
02:11:15 	at omero.api.ServiceInterfacePrxHelper.__write(ServiceInterfacePrxHelper.java:114)
02:11:15 	at omero.api.ServiceListHelper.write(ServiceListHelper.java:37)
02:11:15 	at omero.api.ServiceFactoryPrxHelper.begin_keepAllAlive(ServiceFactoryPrxHelper.java:5946)
02:11:15 	at omero.api.ServiceFactoryPrxHelper.keepAllAlive(ServiceFactoryPrxHelper.java:5846)
02:11:15 	at omero.api.ServiceFactoryPrxHelper.keepAllAlive(ServiceFactoryPrxHelper.java:5833)
02:11:15 	at ome.formats.OMEROMetadataStoreClient.ping(OMEROMetadataStoreClient.java:838)
02:11:15 	... 7 common frames omitted
02:11:15 2025-02-22 02:11:15,952 ERROR [ o.formats.importer.util.ClientKeepAlive] (4-thread-1) Exception while executing ping(), logging Connector out: 
02:11:15 java.lang.RuntimeException: Ice.CommunicatorDestroyedException
02:11:15 	at ome.formats.OMEROMetadataStoreClient.ping(OMEROMetadataStoreClient.java:845)
02:11:15 	at ome.formats.importer.util.ClientKeepAlive.run(ClientKeepAlive.java:77)
02:11:15 	at java.base/java.util.concurrent.Executors$RunnableAdapter.call(Executors.java:515)
02:11:15 	at java.base/java.util.concurrent.FutureTask.runAndReset(FutureTask.java:305)
02:11:15 	at java.base/java.util.concurrent.ScheduledThreadPoolExecutor$ScheduledFutureTask.run(ScheduledThreadPoolExecutor.java:305)
02:11:15 	at java.base/java.util.concurrent.ThreadPoolExecutor.runWorker(ThreadPoolExecutor.java:1128)
02:11:15 	at java.base/java.util.concurrent.ThreadPoolExecutor$Worker.run(ThreadPoolExecutor.java:628)
02:11:15 	at java.base/java.lang.Thread.run(Thread.java:829)
02:11:15 Caused by: Ice.CommunicatorDestroyedException: null
02:11:15 	at IceInternal.Instance.proxyFactory(Instance.java:239)
02:11:15 	at IceInternal.BasicStream.writeProxy(BasicStream.java:2142)
02:11:15 	at omero.api.ServiceInterfacePrxHelper.__write(ServiceInterfacePrxHelper.java:114)
02:11:15 	at omero.api.ServiceListHelper.write(ServiceListHelper.java:37)
02:11:15 	at omero.api.ServiceFactoryPrxHelper.begin_keepAllAlive(ServiceFactoryPrxHelper.java:5946)
02:11:15 	at omero.api.ServiceFactoryPrxHelper.keepAllAlive(ServiceFactoryPrxHelper.java:5846)
02:11:15 	at omero.api.ServiceFactoryPrxHelper.keepAllAlive(ServiceFactoryPrxHelper.java:5833)
02:11:15 	at ome.formats.OMEROMetadataStoreClient.ping(OMEROMetadataStoreClient.java:838)
02:11:15 	... 7 common frames omitted
02:11:23 2025-02-22 02:11:23,616 ERROR [ o.formats.importer.util.ClientKeepAlive] (6-thread-1) Exception while executing ping(), logging Connector out: 
02:11:23 java.lang.RuntimeException: Ice.CommunicatorDestroyedException
02:11:23 	at ome.formats.OMEROMetadataStoreClient.ping(OMEROMetadataStoreClient.java:845)
02:11:23 	at ome.formats.importer.util.ClientKeepAlive.run(ClientKeepAlive.java:77)
02:11:23 	at java.base/java.util.concurrent.Executors$RunnableAdapter.call(Executors.java:515)
02:11:23 	at java.base/java.util.concurrent.FutureTask.runAndReset(FutureTask.java:305)
02:11:23 	at java.base/java.util.concurrent.ScheduledThreadPoolExecutor$ScheduledFutureTask.run(ScheduledThreadPoolExecutor.java:305)
02:11:23 	at java.base/java.util.concurrent.ThreadPoolExecutor.runWorker(ThreadPoolExecutor.java:1128)
02:11:23 	at java.base/java.util.concurrent.ThreadPoolExecutor$Worker.run(ThreadPoolExecutor.java:628)
02:11:23 	at java.base/java.lang.Thread.run(Thread.java:829)
02:11:23 Caused by: Ice.CommunicatorDestroyedException: null
02:11:23 	at IceInternal.Instance.proxyFactory(Instance.java:239)
02:11:23 	at IceInternal.BasicStream.writeProxy(BasicStream.java:2142)
02:11:23 	at omero.api.ServiceInterfacePrxHelper.__write(ServiceInterfacePrxHelper.java:114)
02:11:23 	at omero.api.ServiceListHelper.write(ServiceListHelper.java:37)
02:11:23 	at omero.api.ServiceFactoryPrxHelper.begin_keepAllAlive(ServiceFactoryPrxHelper.java:5946)
02:11:23 	at omero.api.ServiceFactoryPrxHelper.keepAllAlive(ServiceFactoryPrxHelper.java:5846)
02:11:23 	at omero.api.ServiceFactoryPrxHelper.keepAllAlive(ServiceFactoryPrxHelper.java:5833)
02:11:23 	at ome.formats.OMEROMetadataStoreClient.ping(OMEROMetadataStoreClient.java:838)
02:11:23 	... 7 common frames omitted
02:11:24 2025-02-22 02:11:24,470 ERROR [ o.formats.importer.util.ClientKeepAlive] (7-thread-1) Exception while executing ping(), logging Connector out: 
02:11:24 java.lang.RuntimeException: Ice.CommunicatorDestroyedException
02:11:24 	at ome.formats.OMEROMetadataStoreClient.ping(OMEROMetadataStoreClient.java:845)
02:11:24 	at ome.formats.importer.util.ClientKeepAlive.run(ClientKeepAlive.java:77)
02:11:24 	at java.base/java.util.concurrent.Executors$RunnableAdapter.call(Executors.java:515)
02:11:24 	at java.base/java.util.concurrent.FutureTask.runAndReset(FutureTask.java:305)
02:11:24 	at java.base/java.util.concurrent.ScheduledThreadPoolExecutor$ScheduledFutureTask.run(ScheduledThreadPoolExecutor.java:305)
02:11:24 	at java.base/java.util.concurrent.ThreadPoolExecutor.runWorker(ThreadPoolExecutor.java:1128)
02:11:24 	at java.base/java.util.concurrent.ThreadPoolExecutor$Worker.run(ThreadPoolExecutor.java:628)
02:11:24 	at java.base/java.lang.Thread.run(Thread.java:829)
02:11:24 Caused by: Ice.CommunicatorDestroyedException: null
02:11:24 	at IceInternal.Instance.proxyFactory(Instance.java:239)
02:11:24 	at IceInternal.BasicStream.writeProxy(BasicStream.java:2142)
02:11:24 	at omero.api.ServiceInterfacePrxHelper.__write(ServiceInterfacePrxHelper.java:114)
02:11:24 	at omero.api.ServiceListHelper.write(ServiceListHelper.java:37)
02:11:24 	at omero.api.ServiceFactoryPrxHelper.begin_keepAllAlive(ServiceFactoryPrxHelper.java:5946)
02:11:24 	at omero.api.ServiceFactoryPrxHelper.keepAllAlive(ServiceFactoryPrxHelper.java:5846)
02:11:24 	at omero.api.ServiceFactoryPrxHelper.keepAllAlive(ServiceFactoryPrxHelper.java:5833)
02:11:24 	at ome.formats.OMEROMetadataStoreClient.ping(OMEROMetadataStoreClient.java:838)
02:11:24 	... 7 common frames omitted
02:11:30 2025-02-22 02:11:30,938 ERROR [ o.formats.importer.util.ClientKeepAlive] (9-thread-1) Exception while executing ping(), logging Connector out: 
02:11:30 java.lang.RuntimeException: Ice.CommunicatorDestroyedException
02:11:30 	at ome.formats.OMEROMetadataStoreClient.ping(OMEROMetadataStoreClient.java:845)
02:11:30 	at ome.formats.importer.util.ClientKeepAlive.run(ClientKeepAlive.java:77)
02:11:30 	at java.base/java.util.concurrent.Executors$RunnableAdapter.call(Executors.java:515)
02:11:30 	at java.base/java.util.concurrent.FutureTask.runAndReset(FutureTask.java:305)
02:11:30 	at java.base/java.util.concurrent.ScheduledThreadPoolExecutor$ScheduledFutureTask.run(ScheduledThreadPoolExecutor.java:305)
02:11:30 	at java.base/java.util.concurrent.ThreadPoolExecutor.runWorker(ThreadPoolExecutor.java:1128)
02:11:30 	at java.base/java.util.concurrent.ThreadPoolExecutor$Worker.run(ThreadPoolExecutor.java:628)
02:11:30 	at java.base/java.lang.Thread.run(Thread.java:829)
02:11:30 Caused by: Ice.CommunicatorDestroyedException: null
02:11:30 	at IceInternal.Instance.proxyFactory(Instance.java:239)
02:11:30 	at IceInternal.BasicStream.writeProxy(BasicStream.java:2142)
02:11:30 	at omero.api.ServiceInterfacePrxHelper.__write(ServiceInterfacePrxHelper.java:114)
02:11:30 	at omero.api.ServiceListHelper.write(ServiceListHelper.java:37)
02:11:30 	at omero.api.ServiceFactoryPrxHelper.begin_keepAllAlive(ServiceFactoryPrxHelper.java:5946)
02:11:30 	at omero.api.ServiceFactoryPrxHelper.keepAllAlive(ServiceFactoryPrxHelper.java:5846)
02:11:30 	at omero.api.ServiceFactoryPrxHelper.keepAllAlive(ServiceFactoryPrxHelper.java:5833)
02:11:30 	at ome.formats.OMEROMetadataStoreClient.ping(OMEROMetadataStoreClient.java:838)
02:11:30 	... 7 common frames omitted
02:11:31 2025-02-22 02:11:31,849 ERROR [ o.formats.importer.util.ClientKeepAlive] (0-thread-1) Exception while executing ping(), logging Connector out: 
02:11:31 java.lang.RuntimeException: Ice.CommunicatorDestroyedException
02:11:31 	at ome.formats.OMEROMetadataStoreClient.ping(OMEROMetadataStoreClient.java:845)
02:11:31 	at ome.formats.importer.util.ClientKeepAlive.run(ClientKeepAlive.java:77)
02:11:31 	at java.base/java.util.concurrent.Executors$RunnableAdapter.call(Executors.java:515)
02:11:31 	at java.base/java.util.concurrent.FutureTask.runAndReset(FutureTask.java:305)
02:11:31 	at java.base/java.util.concurrent.ScheduledThreadPoolExecutor$ScheduledFutureTask.run(ScheduledThreadPoolExecutor.java:305)
02:11:31 	at java.base/java.util.concurrent.ThreadPoolExecutor.runWorker(ThreadPoolExecutor.java:1128)
02:11:31 	at java.base/java.util.concurrent.ThreadPoolExecutor$Worker.run(ThreadPoolExecutor.java:628)
02:11:31 	at java.base/java.lang.Thread.run(Thread.java:829)
02:11:31 Caused by: Ice.CommunicatorDestroyedException: null
02:11:31 	at IceInternal.Instance.proxyFactory(Instance.java:239)
02:11:31 	at IceInternal.BasicStream.writeProxy(BasicStream.java:2142)
02:11:31 	at omero.api.ServiceInterfacePrxHelper.__write(ServiceInterfacePrxHelper.java:114)
02:11:31 	at omero.api.ServiceListHelper.write(ServiceListHelper.java:37)
02:11:31 	at omero.api.ServiceFactoryPrxHelper.begin_keepAllAlive(ServiceFactoryPrxHelper.java:5946)
02:11:31 	at omero.api.ServiceFactoryPrxHelper.keepAllAlive(ServiceFactoryPrxHelper.java:5846)
02:11:31 	at omero.api.ServiceFactoryPrxHelper.keepAllAlive(ServiceFactoryPrxHelper.java:5833)
02:11:31 	at ome.formats.OMEROMetadataStoreClient.ping(OMEROMetadataStoreClient.java:838)
02:11:31 	... 7 common frames omitted
02:11:39 2025-02-22 02:11:39,370 ERROR [ o.formats.importer.util.ClientKeepAlive] (2-thread-1) Exception while executing ping(), logging Connector out: 
02:11:39 java.lang.RuntimeException: Ice.CommunicatorDestroyedException
02:11:39 	at ome.formats.OMEROMetadataStoreClient.ping(OMEROMetadataStoreClient.java:845)
02:11:39 	at ome.formats.importer.util.ClientKeepAlive.run(ClientKeepAlive.java:77)
02:11:39 	at java.base/java.util.concurrent.Executors$RunnableAdapter.call(Executors.java:515)
02:11:39 	at java.base/java.util.concurrent.FutureTask.runAndReset(FutureTask.java:305)
02:11:39 	at java.base/java.util.concurrent.ScheduledThreadPoolExecutor$ScheduledFutureTask.run(ScheduledThreadPoolExecutor.java:305)
02:11:39 	at java.base/java.util.concurrent.ThreadPoolExecutor.runWorker(ThreadPoolExecutor.java:1128)
02:11:39 	at java.base/java.util.concurrent.ThreadPoolExecutor$Worker.run(ThreadPoolExecutor.java:628)
02:11:39 	at java.base/java.lang.Thread.run(Thread.java:829)
02:11:39 Caused by: Ice.CommunicatorDestroyedException: null
02:11:39 	at IceInternal.Instance.proxyFactory(Instance.java:239)
02:11:39 	at IceInternal.BasicStream.writeProxy(BasicStream.java:2142)
02:11:39 	at omero.api.ServiceInterfacePrxHelper.__write(ServiceInterfacePrxHelper.java:114)
02:11:39 	at omero.api.ServiceListHelper.write(ServiceListHelper.java:37)
02:11:39 	at omero.api.ServiceFactoryPrxHelper.begin_keepAllAlive(ServiceFactoryPrxHelper.java:5946)
02:11:39 	at omero.api.ServiceFactoryPrxHelper.keepAllAlive(ServiceFactoryPrxHelper.java:5846)
02:11:39 	at omero.api.ServiceFactoryPrxHelper.keepAllAlive(ServiceFactoryPrxHelper.java:5833)
02:11:39 	at ome.formats.OMEROMetadataStoreClient.ping(OMEROMetadataStoreClient.java:838)
02:11:39 	... 7 common frames omitted
02:11:40 2025-02-22 02:11:40,233 ERROR [ o.formats.importer.util.ClientKeepAlive] (3-thread-1) Exception while executing ping(), logging Connector out: 
02:11:40 java.lang.RuntimeException: Ice.CommunicatorDestroyedException
02:11:40 	at ome.formats.OMEROMetadataStoreClient.ping(OMEROMetadataStoreClient.java:845)
02:11:40 	at ome.formats.importer.util.ClientKeepAlive.run(ClientKeepAlive.java:77)
02:11:40 	at java.base/java.util.concurrent.Executors$RunnableAdapter.call(Executors.java:515)
02:11:40 	at java.base/java.util.concurrent.FutureTask.runAndReset(FutureTask.java:305)
02:11:40 	at java.base/java.util.concurrent.ScheduledThreadPoolExecutor$ScheduledFutureTask.run(ScheduledThreadPoolExecutor.java:305)
02:11:40 	at java.base/java.util.concurrent.ThreadPoolExecutor.runWorker(ThreadPoolExecutor.java:1128)
02:11:40 	at java.base/java.util.concurrent.ThreadPoolExecutor$Worker.run(ThreadPoolExecutor.java:628)
02:11:40 	at java.base/java.lang.Thread.run(Thread.java:829)
02:11:40 Caused by: Ice.CommunicatorDestroyedException: null
02:11:40 	at IceInternal.Instance.proxyFactory(Instance.java:239)
02:11:40 	at IceInternal.BasicStream.writeProxy(BasicStream.java:2142)
02:11:40 	at omero.api.ServiceInterfacePrxHelper.__write(ServiceInterfacePrxHelper.java:114)
02:11:40 	at omero.api.ServiceListHelper.write(ServiceListHelper.java:37)
02:11:40 	at omero.api.ServiceFactoryPrxHelper.begin_keepAllAlive(ServiceFactoryPrxHelper.java:5946)
02:11:40 	at omero.api.ServiceFactoryPrxHelper.keepAllAlive(ServiceFactoryPrxHelper.java:5846)
02:11:40 	at omero.api.ServiceFactoryPrxHelper.keepAllAlive(ServiceFactoryPrxHelper.java:5833)
02:11:40 	at ome.formats.OMEROMetadataStoreClient.ping(OMEROMetadataStoreClient.java:838)
02:11:40 	... 7 common frames omitted
02:11:46 2025-02-22 02:11:46,787 ERROR [ o.formats.importer.util.ClientKeepAlive] (5-thread-1) Exception while executing ping(), logging Connector out: 
02:11:46 java.lang.RuntimeException: Ice.CommunicatorDestroyedException
02:11:46 	at ome.formats.OMEROMetadataStoreClient.ping(OMEROMetadataStoreClient.java:845)
02:11:46 	at ome.formats.importer.util.ClientKeepAlive.run(ClientKeepAlive.java:77)
02:11:46 	at java.base/java.util.concurrent.Executors$RunnableAdapter.call(Executors.java:515)
02:11:46 	at java.base/java.util.concurrent.FutureTask.runAndReset(FutureTask.java:305)
02:11:46 	at java.base/java.util.concurrent.ScheduledThreadPoolExecutor$ScheduledFutureTask.run(ScheduledThreadPoolExecutor.java:305)
02:11:46 	at java.base/java.util.concurrent.ThreadPoolExecutor.runWorker(ThreadPoolExecutor.java:1128)
02:11:46 	at java.base/java.util.concurrent.ThreadPoolExecutor$Worker.run(ThreadPoolExecutor.java:628)
02:11:46 	at java.base/java.lang.Thread.run(Thread.java:829)
02:11:46 Caused by: Ice.CommunicatorDestroyedException: null
02:11:46 	at IceInternal.Instance.proxyFactory(Instance.java:239)
02:11:46 	at IceInternal.BasicStream.writeProxy(BasicStream.java:2142)
02:11:46 	at omero.api.ServiceInterfacePrxHelper.__write(ServiceInterfacePrxHelper.java:114)
02:11:46 	at omero.api.ServiceListHelper.write(ServiceListHelper.java:37)
02:11:46 	at omero.api.ServiceFactoryPrxHelper.begin_keepAllAlive(ServiceFactoryPrxHelper.java:5946)
02:11:46 	at omero.api.ServiceFactoryPrxHelper.keepAllAlive(ServiceFactoryPrxHelper.java:5846)
02:11:46 	at omero.api.ServiceFactoryPrxHelper.keepAllAlive(ServiceFactoryPrxHelper.java:5833)
02:11:46 	at ome.formats.OMEROMetadataStoreClient.ping(OMEROMetadataStoreClient.java:838)
02:11:46 	... 7 common frames omitted
02:11:47 2025-02-22 02:11:47,651 ERROR [ o.formats.importer.util.ClientKeepAlive] (6-thread-1) Exception while executing ping(), logging Connector out: 
02:11:47 java.lang.RuntimeException: Ice.CommunicatorDestroyedException
02:11:47 	at ome.formats.OMEROMetadataStoreClient.ping(OMEROMetadataStoreClient.java:845)
02:11:47 	at ome.formats.importer.util.ClientKeepAlive.run(ClientKeepAlive.java:77)
02:11:47 	at java.base/java.util.concurrent.Executors$RunnableAdapter.call(Executors.java:515)
02:11:47 	at java.base/java.util.concurrent.FutureTask.runAndReset(FutureTask.java:305)
02:11:47 	at java.base/java.util.concurrent.ScheduledThreadPoolExecutor$ScheduledFutureTask.run(ScheduledThreadPoolExecutor.java:305)
02:11:47 	at java.base/java.util.concurrent.ThreadPoolExecutor.runWorker(ThreadPoolExecutor.java:1128)
02:11:47 	at java.base/java.util.concurrent.ThreadPoolExecutor$Worker.run(ThreadPoolExecutor.java:628)
02:11:47 	at java.base/java.lang.Thread.run(Thread.java:829)
02:11:47 Caused by: Ice.CommunicatorDestroyedException: null
02:11:47 	at IceInternal.Instance.proxyFactory(Instance.java:239)
02:11:47 	at IceInternal.BasicStream.writeProxy(BasicStream.java:2142)
02:11:47 	at omero.api.ServiceInterfacePrxHelper.__write(ServiceInterfacePrxHelper.java:114)
02:11:47 	at omero.api.ServiceListHelper.write(ServiceListHelper.java:37)
02:11:47 	at omero.api.ServiceFactoryPrxHelper.begin_keepAllAlive(ServiceFactoryPrxHelper.java:5946)
02:11:47 	at omero.api.ServiceFactoryPrxHelper.keepAllAlive(ServiceFactoryPrxHelper.java:5846)
02:11:47 	at omero.api.ServiceFactoryPrxHelper.keepAllAlive(ServiceFactoryPrxHelper.java:5833)
02:11:47 	at ome.formats.OMEROMetadataStoreClient.ping(OMEROMetadataStoreClient.java:838)
02:11:47 	... 7 common frames omitted
02:11:51 2025-02-22 02:11:51,300 ERROR [ o.formats.importer.util.ClientKeepAlive] (8-thread-1) Exception while executing ping(), logging Connector out: 
02:11:51 java.lang.RuntimeException: Ice.CommunicatorDestroyedException
02:11:51 	at ome.formats.OMEROMetadataStoreClient.ping(OMEROMetadataStoreClient.java:845)
02:11:51 	at ome.formats.importer.util.ClientKeepAlive.run(ClientKeepAlive.java:77)
02:11:51 	at java.base/java.util.concurrent.Executors$RunnableAdapter.call(Executors.java:515)
02:11:51 	at java.base/java.util.concurrent.FutureTask.runAndReset(FutureTask.java:305)
02:11:51 	at java.base/java.util.concurrent.ScheduledThreadPoolExecutor$ScheduledFutureTask.run(ScheduledThreadPoolExecutor.java:305)
02:11:51 	at java.base/java.util.concurrent.ThreadPoolExecutor.runWorker(ThreadPoolExecutor.java:1128)
02:11:51 	at java.base/java.util.concurrent.ThreadPoolExecutor$Worker.run(ThreadPoolExecutor.java:628)
02:11:51 	at java.base/java.lang.Thread.run(Thread.java:829)
02:11:51 Caused by: Ice.CommunicatorDestroyedException: null
02:11:51 	at IceInternal.Instance.proxyFactory(Instance.java:239)
02:11:51 	at IceInternal.BasicStream.writeProxy(BasicStream.java:2142)
02:11:51 	at omero.api.ServiceInterfacePrxHelper.__write(ServiceInterfacePrxHelper.java:114)
02:11:51 	at omero.api.ServiceListHelper.write(ServiceListHelper.java:37)
02:11:51 	at omero.api.ServiceFactoryPrxHelper.begin_keepAllAlive(ServiceFactoryPrxHelper.java:5946)
02:11:51 	at omero.api.ServiceFactoryPrxHelper.keepAllAlive(ServiceFactoryPrxHelper.java:5846)
02:11:51 	at omero.api.ServiceFactoryPrxHelper.keepAllAlive(ServiceFactoryPrxHelper.java:5833)
02:11:51 	at ome.formats.OMEROMetadataStoreClient.ping(OMEROMetadataStoreClient.java:838)
02:11:51 	... 7 common frames omitted
02:11:52 2025-02-22 02:11:52,185 ERROR [ o.formats.importer.util.ClientKeepAlive] (9-thread-1) Exception while executing ping(), logging Connector out: 
02:11:52 java.lang.RuntimeException: Ice.CommunicatorDestroyedException
02:11:52 	at ome.formats.OMEROMetadataStoreClient.ping(OMEROMetadataStoreClient.java:845)
02:11:52 	at ome.formats.importer.util.ClientKeepAlive.run(ClientKeepAlive.java:77)
02:11:52 	at java.base/java.util.concurrent.Executors$RunnableAdapter.call(Executors.java:515)
02:11:52 	at java.base/java.util.concurrent.FutureTask.runAndReset(FutureTask.java:305)
02:11:52 	at java.base/java.util.concurrent.ScheduledThreadPoolExecutor$ScheduledFutureTask.run(ScheduledThreadPoolExecutor.java:305)
02:11:52 	at java.base/java.util.concurrent.ThreadPoolExecutor.runWorker(ThreadPoolExecutor.java:1128)
02:11:52 	at java.base/java.util.concurrent.ThreadPoolExecutor$Worker.run(ThreadPoolExecutor.java:628)
02:11:52 	at java.base/java.lang.Thread.run(Thread.java:829)
02:11:52 Caused by: Ice.CommunicatorDestroyedException: null
02:11:52 	at IceInternal.Instance.proxyFactory(Instance.java:239)
02:11:52 	at IceInternal.BasicStream.writeProxy(BasicStream.java:2142)
02:11:52 	at omero.api.ServiceInterfacePrxHelper.__write(ServiceInterfacePrxHelper.java:114)
02:11:52 	at omero.api.ServiceListHelper.write(ServiceListHelper.java:37)
02:11:52 	at omero.api.ServiceFactoryPrxHelper.begin_keepAllAlive(ServiceFactoryPrxHelper.java:5946)
02:11:52 	at omero.api.ServiceFactoryPrxHelper.keepAllAlive(ServiceFactoryPrxHelper.java:5846)
02:11:52 	at omero.api.ServiceFactoryPrxHelper.keepAllAlive(ServiceFactoryPrxHelper.java:5833)
02:11:52 	at ome.formats.OMEROMetadataStoreClient.ping(OMEROMetadataStoreClient.java:838)
02:11:52 	... 7 common frames omitted
02:11:58 2025-02-22 02:11:58,927 ERROR [ o.formats.importer.util.ClientKeepAlive] (1-thread-1) Exception while executing ping(), logging Connector out: 
02:11:58 java.lang.RuntimeException: Ice.CommunicatorDestroyedException
02:11:58 	at ome.formats.OMEROMetadataStoreClient.ping(OMEROMetadataStoreClient.java:845)
02:11:58 	at ome.formats.importer.util.ClientKeepAlive.run(ClientKeepAlive.java:77)
02:11:58 	at java.base/java.util.concurrent.Executors$RunnableAdapter.call(Executors.java:515)
02:11:58 	at java.base/java.util.concurrent.FutureTask.runAndReset(FutureTask.java:305)
02:11:58 	at java.base/java.util.concurrent.ScheduledThreadPoolExecutor$ScheduledFutureTask.run(ScheduledThreadPoolExecutor.java:305)
02:11:58 	at java.base/java.util.concurrent.ThreadPoolExecutor.runWorker(ThreadPoolExecutor.java:1128)
02:11:58 	at java.base/java.util.concurrent.ThreadPoolExecutor$Worker.run(ThreadPoolExecutor.java:628)
02:11:58 	at java.base/java.lang.Thread.run(Thread.java:829)
02:11:58 Caused by: Ice.CommunicatorDestroyedException: null
02:11:58 	at IceInternal.Instance.proxyFactory(Instance.java:239)
02:11:58 	at IceInternal.BasicStream.writeProxy(BasicStream.java:2142)
02:11:58 	at omero.api.ServiceInterfacePrxHelper.__write(ServiceInterfacePrxHelper.java:114)
02:11:58 	at omero.api.ServiceListHelper.write(ServiceListHelper.java:37)
02:11:58 	at omero.api.ServiceFactoryPrxHelper.begin_keepAllAlive(ServiceFactoryPrxHelper.java:5946)
02:11:58 	at omero.api.ServiceFactoryPrxHelper.keepAllAlive(ServiceFactoryPrxHelper.java:5846)
02:11:58 	at omero.api.ServiceFactoryPrxHelper.keepAllAlive(ServiceFactoryPrxHelper.java:5833)
02:11:58 	at ome.formats.OMEROMetadataStoreClient.ping(OMEROMetadataStoreClient.java:838)
02:11:58 	... 7 common frames omitted
02:11:59 2025-02-22 02:11:59,775 ERROR [ o.formats.importer.util.ClientKeepAlive] (2-thread-1) Exception while executing ping(), logging Connector out: 
02:11:59 java.lang.RuntimeException: Ice.CommunicatorDestroyedException
02:11:59 	at ome.formats.OMEROMetadataStoreClient.ping(OMEROMetadataStoreClient.java:845)
02:11:59 	at ome.formats.importer.util.ClientKeepAlive.run(ClientKeepAlive.java:77)
02:11:59 	at java.base/java.util.concurrent.Executors$RunnableAdapter.call(Executors.java:515)
02:11:59 	at java.base/java.util.concurrent.FutureTask.runAndReset(FutureTask.java:305)
02:11:59 	at java.base/java.util.concurrent.ScheduledThreadPoolExecutor$ScheduledFutureTask.run(ScheduledThreadPoolExecutor.java:305)
02:11:59 	at java.base/java.util.concurrent.ThreadPoolExecutor.runWorker(ThreadPoolExecutor.java:1128)
02:11:59 	at java.base/java.util.concurrent.ThreadPoolExecutor$Worker.run(ThreadPoolExecutor.java:628)
02:11:59 	at java.base/java.lang.Thread.run(Thread.java:829)
02:11:59 Caused by: Ice.CommunicatorDestroyedException: null
02:11:59 	at IceInternal.Instance.proxyFactory(Instance.java:239)
02:11:59 	at IceInternal.BasicStream.writeProxy(BasicStream.java:2142)
02:11:59 	at omero.api.ServiceInterfacePrxHelper.__write(ServiceInterfacePrxHelper.java:114)
02:11:59 	at omero.api.ServiceListHelper.write(ServiceListHelper.java:37)
02:11:59 	at omero.api.ServiceFactoryPrxHelper.begin_keepAllAlive(ServiceFactoryPrxHelper.java:5946)
02:11:59 	at omero.api.ServiceFactoryPrxHelper.keepAllAlive(ServiceFactoryPrxHelper.java:5846)
02:11:59 	at omero.api.ServiceFactoryPrxHelper.keepAllAlive(ServiceFactoryPrxHelper.java:5833)
02:11:59 	at ome.formats.OMEROMetadataStoreClient.ping(OMEROMetadataStoreClient.java:838)
02:11:59 	... 7 common frames omitted
02:12:06 2025-02-22 02:12:06,556 ERROR [ o.formats.importer.util.ClientKeepAlive] (4-thread-1) Exception while executing ping(), logging Connector out: 
02:12:06 java.lang.RuntimeException: Ice.CommunicatorDestroyedException
02:12:06 	at ome.formats.OMEROMetadataStoreClient.ping(OMEROMetadataStoreClient.java:845)
02:12:06 	at ome.formats.importer.util.ClientKeepAlive.run(ClientKeepAlive.java:77)
02:12:06 	at java.base/java.util.concurrent.Executors$RunnableAdapter.call(Executors.java:515)
02:12:06 	at java.base/java.util.concurrent.FutureTask.runAndReset(FutureTask.java:305)
02:12:06 	at java.base/java.util.concurrent.ScheduledThreadPoolExecutor$ScheduledFutureTask.run(ScheduledThreadPoolExecutor.java:305)
02:12:06 	at java.base/java.util.concurrent.ThreadPoolExecutor.runWorker(ThreadPoolExecutor.java:1128)
02:12:06 	at java.base/java.util.concurrent.ThreadPoolExecutor$Worker.run(ThreadPoolExecutor.java:628)
02:12:06 	at java.base/java.lang.Thread.run(Thread.java:829)
02:12:06 Caused by: Ice.CommunicatorDestroyedException: null
02:12:06 	at IceInternal.Instance.proxyFactory(Instance.java:239)
02:12:06 	at IceInternal.BasicStream.writeProxy(BasicStream.java:2142)
02:12:06 	at omero.api.ServiceInterfacePrxHelper.__write(ServiceInterfacePrxHelper.java:114)
02:12:06 	at omero.api.ServiceListHelper.write(ServiceListHelper.java:37)
02:12:06 	at omero.api.ServiceFactoryPrxHelper.begin_keepAllAlive(ServiceFactoryPrxHelper.java:5946)
02:12:06 	at omero.api.ServiceFactoryPrxHelper.keepAllAlive(ServiceFactoryPrxHelper.java:5846)
02:12:06 	at omero.api.ServiceFactoryPrxHelper.keepAllAlive(ServiceFactoryPrxHelper.java:5833)
02:12:06 	at ome.formats.OMEROMetadataStoreClient.ping(OMEROMetadataStoreClient.java:838)
02:12:06 	... 7 common frames omitted
02:12:07 2025-02-22 02:12:07,443 ERROR [ o.formats.importer.util.ClientKeepAlive] (5-thread-1) Exception while executing ping(), logging Connector out: 
02:12:07 java.lang.RuntimeException: Ice.CommunicatorDestroyedException
02:12:07 	at ome.formats.OMEROMetadataStoreClient.ping(OMEROMetadataStoreClient.java:845)
02:12:07 	at ome.formats.importer.util.ClientKeepAlive.run(ClientKeepAlive.java:77)
02:12:07 	at java.base/java.util.concurrent.Executors$RunnableAdapter.call(Executors.java:515)
02:12:07 	at java.base/java.util.concurrent.FutureTask.runAndReset(FutureTask.java:305)
02:12:07 	at java.base/java.util.concurrent.ScheduledThreadPoolExecutor$ScheduledFutureTask.run(ScheduledThreadPoolExecutor.java:305)
02:12:07 	at java.base/java.util.concurrent.ThreadPoolExecutor.runWorker(ThreadPoolExecutor.java:1128)
02:12:07 	at java.base/java.util.concurrent.ThreadPoolExecutor$Worker.run(ThreadPoolExecutor.java:628)
02:12:07 	at java.base/java.lang.Thread.run(Thread.java:829)
02:12:07 Caused by: Ice.CommunicatorDestroyedException: null
02:12:07 	at IceInternal.Instance.proxyFactory(Instance.java:239)
02:12:07 	at IceInternal.BasicStream.writeProxy(BasicStream.java:2142)
02:12:07 	at omero.api.ServiceInterfacePrxHelper.__write(ServiceInterfacePrxHelper.java:114)
02:12:07 	at omero.api.ServiceListHelper.write(ServiceListHelper.java:37)
02:12:07 	at omero.api.ServiceFactoryPrxHelper.begin_keepAllAlive(ServiceFactoryPrxHelper.java:5946)
02:12:07 	at omero.api.ServiceFactoryPrxHelper.keepAllAlive(ServiceFactoryPrxHelper.java:5846)
02:12:07 	at omero.api.ServiceFactoryPrxHelper.keepAllAlive(ServiceFactoryPrxHelper.java:5833)
02:12:07 	at ome.formats.OMEROMetadataStoreClient.ping(OMEROMetadataStoreClient.java:838)
02:12:07 	... 7 common frames omitted
02:12:11 2025-02-22 02:12:11,178 ERROR [ o.formats.importer.util.ClientKeepAlive] (7-thread-1) Exception while executing ping(), logging Connector out: 
02:12:11 java.lang.RuntimeException: Ice.CommunicatorDestroyedException
02:12:11 	at ome.formats.OMEROMetadataStoreClient.ping(OMEROMetadataStoreClient.java:845)
02:12:11 	at ome.formats.importer.util.ClientKeepAlive.run(ClientKeepAlive.java:77)
02:12:11 	at java.base/java.util.concurrent.Executors$RunnableAdapter.call(Executors.java:515)
02:12:11 	at java.base/java.util.concurrent.FutureTask.runAndReset(FutureTask.java:305)
02:12:11 	at java.base/java.util.concurrent.ScheduledThreadPoolExecutor$ScheduledFutureTask.run(ScheduledThreadPoolExecutor.java:305)
02:12:11 	at java.base/java.util.concurrent.ThreadPoolExecutor.runWorker(ThreadPoolExecutor.java:1128)
02:12:11 	at java.base/java.util.concurrent.ThreadPoolExecutor$Worker.run(ThreadPoolExecutor.java:628)
02:12:11 	at java.base/java.lang.Thread.run(Thread.java:829)
02:12:11 Caused by: Ice.CommunicatorDestroyedException: null
02:12:11 	at IceInternal.Instance.proxyFactory(Instance.java:239)
02:12:11 	at IceInternal.BasicStream.writeProxy(BasicStream.java:2142)
02:12:11 	at omero.api.ServiceInterfacePrxHelper.__write(ServiceInterfacePrxHelper.java:114)
02:12:11 	at omero.api.ServiceListHelper.write(ServiceListHelper.java:37)
02:12:11 	at omero.api.ServiceFactoryPrxHelper.begin_keepAllAlive(ServiceFactoryPrxHelper.java:5946)
02:12:11 	at omero.api.ServiceFactoryPrxHelper.keepAllAlive(ServiceFactoryPrxHelper.java:5846)
02:12:11 	at omero.api.ServiceFactoryPrxHelper.keepAllAlive(ServiceFactoryPrxHelper.java:5833)
02:12:11 	at ome.formats.OMEROMetadataStoreClient.ping(OMEROMetadataStoreClient.java:838)
02:12:11 	... 7 common frames omitted
02:12:12 2025-02-22 02:12:12,064 ERROR [ o.formats.importer.util.ClientKeepAlive] (8-thread-1) Exception while executing ping(), logging Connector out: 
02:12:12 java.lang.RuntimeException: Ice.CommunicatorDestroyedException
02:12:12 	at ome.formats.OMEROMetadataStoreClient.ping(OMEROMetadataStoreClient.java:845)
02:12:12 	at ome.formats.importer.util.ClientKeepAlive.run(ClientKeepAlive.java:77)
02:12:12 	at java.base/java.util.concurrent.Executors$RunnableAdapter.call(Executors.java:515)
02:12:12 	at java.base/java.util.concurrent.FutureTask.runAndReset(FutureTask.java:305)
02:12:12 	at java.base/java.util.concurrent.ScheduledThreadPoolExecutor$ScheduledFutureTask.run(ScheduledThreadPoolExecutor.java:305)
02:12:12 	at java.base/java.util.concurrent.ThreadPoolExecutor.runWorker(ThreadPoolExecutor.java:1128)
02:12:12 	at java.base/java.util.concurrent.ThreadPoolExecutor$Worker.run(ThreadPoolExecutor.java:628)
02:12:12 	at java.base/java.lang.Thread.run(Thread.java:829)
02:12:12 Caused by: Ice.CommunicatorDestroyedException: null
02:12:12 	at IceInternal.Instance.proxyFactory(Instance.java:239)
02:12:12 	at IceInternal.BasicStream.writeProxy(BasicStream.java:2142)
02:12:12 	at omero.api.ServiceInterfacePrxHelper.__write(ServiceInterfacePrxHelper.java:114)
02:12:12 	at omero.api.ServiceListHelper.write(ServiceListHelper.java:37)
02:12:12 	at omero.api.ServiceFactoryPrxHelper.begin_keepAllAlive(ServiceFactoryPrxHelper.java:5946)
02:12:12 	at omero.api.ServiceFactoryPrxHelper.keepAllAlive(ServiceFactoryPrxHelper.java:5846)
02:12:12 	at omero.api.ServiceFactoryPrxHelper.keepAllAlive(ServiceFactoryPrxHelper.java:5833)
02:12:12 	at ome.formats.OMEROMetadataStoreClient.ping(OMEROMetadataStoreClient.java:838)
02:12:12 	... 7 common frames omitted
02:12:18 2025-02-22 02:12:18,704 ERROR [ o.formats.importer.util.ClientKeepAlive] (0-thread-1) Exception while executing ping(), logging Connector out: 
02:12:18 java.lang.RuntimeException: Ice.CommunicatorDestroyedException
02:12:18 	at ome.formats.OMEROMetadataStoreClient.ping(OMEROMetadataStoreClient.java:845)
02:12:18 	at ome.formats.importer.util.ClientKeepAlive.run(ClientKeepAlive.java:77)
02:12:18 	at java.base/java.util.concurrent.Executors$RunnableAdapter.call(Executors.java:515)
02:12:18 	at java.base/java.util.concurrent.FutureTask.runAndReset(FutureTask.java:305)
02:12:18 	at java.base/java.util.concurrent.ScheduledThreadPoolExecutor$ScheduledFutureTask.run(ScheduledThreadPoolExecutor.java:305)
02:12:18 	at java.base/java.util.concurrent.ThreadPoolExecutor.runWorker(ThreadPoolExecutor.java:1128)
02:12:18 	at java.base/java.util.concurrent.ThreadPoolExecutor$Worker.run(ThreadPoolExecutor.java:628)
02:12:18 	at java.base/java.lang.Thread.run(Thread.java:829)
02:12:18 Caused by: Ice.CommunicatorDestroyedException: null
02:12:18 	at IceInternal.Instance.proxyFactory(Instance.java:239)
02:12:18 	at IceInternal.BasicStream.writeProxy(BasicStream.java:2142)
02:12:18 	at omero.api.ServiceInterfacePrxHelper.__write(ServiceInterfacePrxHelper.java:114)
02:12:18 	at omero.api.ServiceListHelper.write(ServiceListHelper.java:37)
02:12:18 	at omero.api.ServiceFactoryPrxHelper.begin_keepAllAlive(ServiceFactoryPrxHelper.java:5946)
02:12:18 	at omero.api.ServiceFactoryPrxHelper.keepAllAlive(ServiceFactoryPrxHelper.java:5846)
02:12:18 	at omero.api.ServiceFactoryPrxHelper.keepAllAlive(ServiceFactoryPrxHelper.java:5833)
02:12:18 	at ome.formats.OMEROMetadataStoreClient.ping(OMEROMetadataStoreClient.java:838)
02:12:18 	... 7 common frames omitted
02:12:19 2025-02-22 02:12:19,549 ERROR [ o.formats.importer.util.ClientKeepAlive] (1-thread-1) Exception while executing ping(), logging Connector out: 
02:12:19 java.lang.RuntimeException: Ice.CommunicatorDestroyedException
02:12:19 	at ome.formats.OMEROMetadataStoreClient.ping(OMEROMetadataStoreClient.java:845)
02:12:19 	at ome.formats.importer.util.ClientKeepAlive.run(ClientKeepAlive.java:77)
02:12:19 	at java.base/java.util.concurrent.Executors$RunnableAdapter.call(Executors.java:515)
02:12:19 	at java.base/java.util.concurrent.FutureTask.runAndReset(FutureTask.java:305)
02:12:19 	at java.base/java.util.concurrent.ScheduledThreadPoolExecutor$ScheduledFutureTask.run(ScheduledThreadPoolExecutor.java:305)
02:12:19 	at java.base/java.util.concurrent.ThreadPoolExecutor.runWorker(ThreadPoolExecutor.java:1128)
02:12:19 	at java.base/java.util.concurrent.ThreadPoolExecutor$Worker.run(ThreadPoolExecutor.java:628)
02:12:19 	at java.base/java.lang.Thread.run(Thread.java:829)
02:12:19 Caused by: Ice.CommunicatorDestroyedException: null
02:12:19 	at IceInternal.Instance.proxyFactory(Instance.java:239)
02:12:19 	at IceInternal.BasicStream.writeProxy(BasicStream.java:2142)
02:12:19 	at omero.api.ServiceInterfacePrxHelper.__write(ServiceInterfacePrxHelper.java:114)
02:12:19 	at omero.api.ServiceListHelper.write(ServiceListHelper.java:37)
02:12:19 	at omero.api.ServiceFactoryPrxHelper.begin_keepAllAlive(ServiceFactoryPrxHelper.java:5946)
02:12:19 	at omero.api.ServiceFactoryPrxHelper.keepAllAlive(ServiceFactoryPrxHelper.java:5846)
02:12:19 	at omero.api.ServiceFactoryPrxHelper.keepAllAlive(ServiceFactoryPrxHelper.java:5833)
02:12:19 	at ome.formats.OMEROMetadataStoreClient.ping(OMEROMetadataStoreClient.java:838)
02:12:19 	... 7 common frames omitted
02:12:23 2025-02-22 02:12:23,163 ERROR [ o.formats.importer.util.ClientKeepAlive] (3-thread-1) Exception while executing ping(), logging Connector out: 
02:12:23 java.lang.RuntimeException: Ice.CommunicatorDestroyedException
02:12:23 	at ome.formats.OMEROMetadataStoreClient.ping(OMEROMetadataStoreClient.java:845)
02:12:23 	at ome.formats.importer.util.ClientKeepAlive.run(ClientKeepAlive.java:77)
02:12:23 	at java.base/java.util.concurrent.Executors$RunnableAdapter.call(Executors.java:515)
02:12:23 	at java.base/java.util.concurrent.FutureTask.runAndReset(FutureTask.java:305)
02:12:23 	at java.base/java.util.concurrent.ScheduledThreadPoolExecutor$ScheduledFutureTask.run(ScheduledThreadPoolExecutor.java:305)
02:12:23 	at java.base/java.util.concurrent.ThreadPoolExecutor.runWorker(ThreadPoolExecutor.java:1128)
02:12:23 	at java.base/java.util.concurrent.ThreadPoolExecutor$Worker.run(ThreadPoolExecutor.java:628)
02:12:23 	at java.base/java.lang.Thread.run(Thread.java:829)
02:12:23 Caused by: Ice.CommunicatorDestroyedException: null
02:12:23 	at IceInternal.Instance.proxyFactory(Instance.java:239)
02:12:23 	at IceInternal.BasicStream.writeProxy(BasicStream.java:2142)
02:12:23 	at omero.api.ServiceInterfacePrxHelper.__write(ServiceInterfacePrxHelper.java:114)
02:12:23 	at omero.api.ServiceListHelper.write(ServiceListHelper.java:37)
02:12:23 	at omero.api.ServiceFactoryPrxHelper.begin_keepAllAlive(ServiceFactoryPrxHelper.java:5946)
02:12:23 	at omero.api.ServiceFactoryPrxHelper.keepAllAlive(ServiceFactoryPrxHelper.java:5846)
02:12:23 	at omero.api.ServiceFactoryPrxHelper.keepAllAlive(ServiceFactoryPrxHelper.java:5833)
02:12:23 	at ome.formats.OMEROMetadataStoreClient.ping(OMEROMetadataStoreClient.java:838)
02:12:23 	... 7 common frames omitted
02:12:24 2025-02-22 02:12:24,154 ERROR [ o.formats.importer.util.ClientKeepAlive] (4-thread-1) Exception while executing ping(), logging Connector out: 
02:12:24 java.lang.RuntimeException: Ice.CommunicatorDestroyedException
02:12:24 	at ome.formats.OMEROMetadataStoreClient.ping(OMEROMetadataStoreClient.java:845)
02:12:24 	at ome.formats.importer.util.ClientKeepAlive.run(ClientKeepAlive.java:77)
02:12:24 	at java.base/java.util.concurrent.Executors$RunnableAdapter.call(Executors.java:515)
02:12:24 	at java.base/java.util.concurrent.FutureTask.runAndReset(FutureTask.java:305)
02:12:24 	at java.base/java.util.concurrent.ScheduledThreadPoolExecutor$ScheduledFutureTask.run(ScheduledThreadPoolExecutor.java:305)
02:12:24 	at java.base/java.util.concurrent.ThreadPoolExecutor.runWorker(ThreadPoolExecutor.java:1128)
02:12:24 	at java.base/java.util.concurrent.ThreadPoolExecutor$Worker.run(ThreadPoolExecutor.java:628)
02:12:24 	at java.base/java.lang.Thread.run(Thread.java:829)
02:12:24 Caused by: Ice.CommunicatorDestroyedException: null
02:12:24 	at IceInternal.Instance.proxyFactory(Instance.java:239)
02:12:24 	at IceInternal.BasicStream.writeProxy(BasicStream.java:2142)
02:12:24 	at omero.api.ServiceInterfacePrxHelper.__write(ServiceInterfacePrxHelper.java:114)
02:12:24 	at omero.api.ServiceListHelper.write(ServiceListHelper.java:37)
02:12:24 	at omero.api.ServiceFactoryPrxHelper.begin_keepAllAlive(ServiceFactoryPrxHelper.java:5946)
02:12:24 	at omero.api.ServiceFactoryPrxHelper.keepAllAlive(ServiceFactoryPrxHelper.java:5846)
02:12:24 	at omero.api.ServiceFactoryPrxHelper.keepAllAlive(ServiceFactoryPrxHelper.java:5833)
02:12:24 	at ome.formats.OMEROMetadataStoreClient.ping(OMEROMetadataStoreClient.java:838)
02:12:24 	... 7 common frames omitted
02:12:26 ===============================================
02:12:26 OmeroJava.integration
02:12:26 Total tests run: 2589, Passes: 2588, Failures: 1, Skips: 0
02:12:26 ===============================================
02:12:28 The tests failed.
02:12:28 
02:12:28 BUILD SUCCESSFUL
02:12:28 Total time: 65 minutes 21 seconds
02:12:28 + /home/omero/workspace/OMERO-test-integration/src/build.py -f components/tools/OmeroPy/build.xml integration -Dtestreports.dir=target/reports/integration
02:12:28 OpenJDK 64-Bit Server VM warning: Ignoring option MaxPermSize; support was removed in 8.0
02:12:28 Buildfile: /home/omero/workspace/OMERO-test-integration/src/components/tools/OmeroPy/build.xml
02:12:29 Entering /home/omero/workspace/OMERO-test-integration/src/components/tools/OmeroPy...
02:12:29 Entering /home/omero/workspace/OMERO-test-integration/src/components/tools/OmeroPy...
02:12:29 
02:12:29 python-integration:
02:12:29 Created dir: /home/omero/workspace/OMERO-test-integration/src/components/tools/OmeroPy/target/reports/integration
02:12:30 ============================= test session starts ==============================
02:12:30 platform linux -- Python 3.9.18, pytest-8.3.4, pluggy-1.5.0 -- /home/omero/workspace/OMERO-test-integration/.venv3/bin/python3
02:12:30 cachedir: .pytest_cache
02:12:30 django: version: 4.2.19, settings: omeroweb.settings (from ini)
02:12:30 rootdir: /home/omero/workspace/OMERO-test-integration/src/components/tools
02:12:30 configfile: pytest.ini
02:12:30 plugins: xdist-3.6.1, mock-3.14.0, django-4.10.0
02:12:35 collecting ... collected 2061 items / 36 deselected / 2025 selected
02:12:37 test/integration/clitest/test_admin.py::TestAdmin::test_checkupgrade0 FAILED [  0%]
02:12:37 test/integration/clitest/test_admin.py::TestAdmin::test_checkupgrade1 PASSED [  0%]
02:12:38 test/integration/clitest/test_admin.py::TestAdmin::test_log PASSED       [  0%]
02:12:41 test/integration/clitest/test_admin.py::TestAdminRestrictedAdmin::test_log PASSED [  0%]
02:12:41 test/integration/clitest/test_admin.py::TestAdminRestrictedAdmin::test_checkupgrade0 FAILED [  0%]
02:12:41 test/integration/clitest/test_admin.py::TestAdminRestrictedAdmin::test_checkupgrade1 PASSED [  0%]
02:12:44 test/integration/clitest/test_chgrp.py::TestChgrp::testChgrpMyData[-rw-----Image] PASSED [  0%]
02:12:44 test/integration/clitest/test_chgrp.py::TestChgrp::testChgrpMyData[-rw-----Dataset] PASSED [  0%]
02:12:44 test/integration/clitest/test_chgrp.py::TestChgrp::testChgrpMyData[-rw-----Project] PASSED [  0%]
02:12:44 test/integration/clitest/test_chgrp.py::TestChgrp::testChgrpMyData[-rw-----Plate] PASSED [  0%]
02:12:44 test/integration/clitest/test_chgrp.py::TestChgrp::testChgrpMyData[-rw-----Screen] PASSED [  0%]
02:12:44 test/integration/clitest/test_chgrp.py::TestChgrp::testChgrpMyData[-rwr----Image] PASSED [  0%]
02:12:44 test/integration/clitest/test_chgrp.py::TestChgrp::testChgrpMyData[-rwr----Dataset] PASSED [  0%]
02:12:44 test/integration/clitest/test_chgrp.py::TestChgrp::testChgrpMyData[-rwr----Project] PASSED [  0%]
02:12:44 test/integration/clitest/test_chgrp.py::TestChgrp::testChgrpMyData[-rwr----Plate] PASSED [  0%]
02:12:44 test/integration/clitest/test_chgrp.py::TestChgrp::testChgrpMyData[-rwr----Screen] PASSED [  0%]
02:12:44 test/integration/clitest/test_chgrp.py::TestChgrp::testChgrpMyData[-rwra---Image] PASSED [  0%]
02:12:44 test/integration/clitest/test_chgrp.py::TestChgrp::testChgrpMyData[-rwra---Dataset] PASSED [  0%]
02:12:44 test/integration/clitest/test_chgrp.py::TestChgrp::testChgrpMyData[-rwra---Project] PASSED [  0%]
02:12:45 test/integration/clitest/test_chgrp.py::TestChgrp::testChgrpMyData[-rwra---Plate] PASSED [  0%]
02:12:45 test/integration/clitest/test_chgrp.py::TestChgrp::testChgrpMyData[-rwra---Screen] PASSED [  1%]
02:12:45 test/integration/clitest/test_chgrp.py::TestChgrp::testChgrpMyData[-rwrw---Image] PASSED [  1%]
02:12:45 test/integration/clitest/test_chgrp.py::TestChgrp::testChgrpMyData[-rwrw---Dataset] PASSED [  1%]
02:12:45 test/integration/clitest/test_chgrp.py::TestChgrp::testChgrpMyData[-rwrw---Project] PASSED [  1%]
02:12:45 test/integration/clitest/test_chgrp.py::TestChgrp::testChgrpMyData[-rwrw---Plate] PASSED [  1%]
02:12:45 test/integration/clitest/test_chgrp.py::TestChgrp::testChgrpMyData[-rwrw---Screen] PASSED [  1%]
02:12:45 test/integration/clitest/test_chgrp.py::TestChgrp::testChgrpMyData[Group:-rw-----Image] PASSED [  1%]
02:12:45 test/integration/clitest/test_chgrp.py::TestChgrp::testChgrpMyData[Group:-rw-----Dataset] PASSED [  1%]
02:12:45 test/integration/clitest/test_chgrp.py::TestChgrp::testChgrpMyData[Group:-rw-----Project] PASSED [  1%]
02:12:45 test/integration/clitest/test_chgrp.py::TestChgrp::testChgrpMyData[Group:-rw-----Plate] PASSED [  1%]
02:12:45 test/integration/clitest/test_chgrp.py::TestChgrp::testChgrpMyData[Group:-rw-----Screen] PASSED [  1%]
02:12:45 test/integration/clitest/test_chgrp.py::TestChgrp::testChgrpMyData[Group:-rwr----Image] PASSED [  1%]
02:12:45 test/integration/clitest/test_chgrp.py::TestChgrp::testChgrpMyData[Group:-rwr----Dataset] PASSED [  1%]
02:12:45 test/integration/clitest/test_chgrp.py::TestChgrp::testChgrpMyData[Group:-rwr----Project] PASSED [  1%]
02:12:46 test/integration/clitest/test_chgrp.py::TestChgrp::testChgrpMyData[Group:-rwr----Plate] PASSED [  1%]
02:12:46 test/integration/clitest/test_chgrp.py::TestChgrp::testChgrpMyData[Group:-rwr----Screen] PASSED [  1%]
02:12:46 test/integration/clitest/test_chgrp.py::TestChgrp::testChgrpMyData[Group:-rwra---Image] PASSED [  1%]
02:12:46 test/integration/clitest/test_chgrp.py::TestChgrp::testChgrpMyData[Group:-rwra---Dataset] PASSED [  1%]
02:12:46 test/integration/clitest/test_chgrp.py::TestChgrp::testChgrpMyData[Group:-rwra---Project] PASSED [  1%]
02:12:46 test/integration/clitest/test_chgrp.py::TestChgrp::testChgrpMyData[Group:-rwra---Plate] PASSED [  1%]
02:12:46 test/integration/clitest/test_chgrp.py::TestChgrp::testChgrpMyData[Group:-rwra---Screen] PASSED [  2%]
02:12:46 test/integration/clitest/test_chgrp.py::TestChgrp::testChgrpMyData[Group:-rwrw---Image] PASSED [  2%]
02:12:46 test/integration/clitest/test_chgrp.py::TestChgrp::testChgrpMyData[Group:-rwrw---Dataset] PASSED [  2%]
02:12:46 test/integration/clitest/test_chgrp.py::TestChgrp::testChgrpMyData[Group:-rwrw---Project] PASSED [  2%]
02:12:46 test/integration/clitest/test_chgrp.py::TestChgrp::testChgrpMyData[Group:-rwrw---Plate] PASSED [  2%]
02:12:46 test/integration/clitest/test_chgrp.py::TestChgrp::testChgrpMyData[Group:-rwrw---Screen] PASSED [  2%]
02:12:46 test/integration/clitest/test_chgrp.py::TestChgrp::testChgrpMyData[ExperimenterGroup:-rw-----Image] PASSED [  2%]
02:12:46 test/integration/clitest/test_chgrp.py::TestChgrp::testChgrpMyData[ExperimenterGroup:-rw-----Dataset] PASSED [  2%]
02:12:46 test/integration/clitest/test_chgrp.py::TestChgrp::testChgrpMyData[ExperimenterGroup:-rw-----Project] PASSED [  2%]
02:12:47 test/integration/clitest/test_chgrp.py::TestChgrp::testChgrpMyData[ExperimenterGroup:-rw-----Plate] PASSED [  2%]
02:12:47 test/integration/clitest/test_chgrp.py::TestChgrp::testChgrpMyData[ExperimenterGroup:-rw-----Screen] PASSED [  2%]
02:12:47 test/integration/clitest/test_chgrp.py::TestChgrp::testChgrpMyData[ExperimenterGroup:-rwr----Image] PASSED [  2%]
02:12:47 test/integration/clitest/test_chgrp.py::TestChgrp::testChgrpMyData[ExperimenterGroup:-rwr----Dataset] PASSED [  2%]
02:12:47 test/integration/clitest/test_chgrp.py::TestChgrp::testChgrpMyData[ExperimenterGroup:-rwr----Project] PASSED [  2%]
02:12:47 test/integration/clitest/test_chgrp.py::TestChgrp::testChgrpMyData[ExperimenterGroup:-rwr----Plate] PASSED [  2%]
02:12:47 test/integration/clitest/test_chgrp.py::TestChgrp::testChgrpMyData[ExperimenterGroup:-rwr----Screen] PASSED [  2%]
02:12:47 test/integration/clitest/test_chgrp.py::TestChgrp::testChgrpMyData[ExperimenterGroup:-rwra---Image] PASSED [  2%]
02:12:47 test/integration/clitest/test_chgrp.py::TestChgrp::testChgrpMyData[ExperimenterGroup:-rwra---Dataset] PASSED [  2%]
02:12:47 test/integration/clitest/test_chgrp.py::TestChgrp::testChgrpMyData[ExperimenterGroup:-rwra---Project] PASSED [  2%]
02:12:47 test/integration/clitest/test_chgrp.py::TestChgrp::testChgrpMyData[ExperimenterGroup:-rwra---Plate] PASSED [  2%]
02:12:47 test/integration/clitest/test_chgrp.py::TestChgrp::testChgrpMyData[ExperimenterGroup:-rwra---Screen] PASSED [  3%]
02:12:47 test/integration/clitest/test_chgrp.py::TestChgrp::testChgrpMyData[ExperimenterGroup:-rwrw---Image] PASSED [  3%]
02:12:47 test/integration/clitest/test_chgrp.py::TestChgrp::testChgrpMyData[ExperimenterGroup:-rwrw---Dataset] PASSED [  3%]
02:12:47 test/integration/clitest/test_chgrp.py::TestChgrp::testChgrpMyData[ExperimenterGroup:-rwrw---Project] PASSED [  3%]
02:12:48 test/integration/clitest/test_chgrp.py::TestChgrp::testChgrpMyData[ExperimenterGroup:-rwrw---Plate] PASSED [  3%]
02:12:48 test/integration/clitest/test_chgrp.py::TestChgrp::testChgrpMyData[ExperimenterGroup:-rwrw---Screen] PASSED [  3%]
02:12:48 test/integration/clitest/test_chgrp.py::TestChgrp::testNonMember PASSED  [  3%]
02:12:48 test/integration/clitest/test_chgrp.py::TestChgrp::testGroupName PASSED  [  3%]
02:12:52 test/integration/clitest/test_chgrp.py::TestChgrp::testFileset PASSED    [  3%]
02:12:55 test/integration/clitest/test_chgrp.py::TestChgrp::testFilesetPartialFailing PASSED [  3%]
02:12:58 test/integration/clitest/test_chgrp.py::TestChgrp::testFilesetOneImage PASSED [  3%]
02:13:02 test/integration/clitest/test_chgrp.py::TestChgrp::testFilesetAllImagesMoveImages PASSED [  3%]
02:13:05 test/integration/clitest/test_chgrp.py::TestChgrp::testFilesetAllImagesMoveDataset PASSED [  3%]
02:13:05 test/integration/clitest/test_chgrp.py::TestChgrp::testNonExistingGroupId[] PASSED [  3%]
02:13:05 test/integration/clitest/test_chgrp.py::TestChgrp::testNonExistingGroupId[Group:] PASSED [  3%]
02:13:05 test/integration/clitest/test_chgrp.py::TestChgrp::testNonExistingGroupId[ExperimenterGroup:] PASSED [  3%]
02:13:05 test/integration/clitest/test_chgrp.py::TestChgrp::testNonExistingGroupName PASSED [  3%]
02:13:05 test/integration/clitest/test_chgrp.py::TestChgrp::testMultipleSimpleObjectsSameClass[True-1] PASSED [  3%]
02:13:05 test/integration/clitest/test_chgrp.py::TestChgrp::testMultipleSimpleObjectsSameClass[True-2] PASSED [  3%]
02:13:05 test/integration/clitest/test_chgrp.py::TestChgrp::testMultipleSimpleObjectsSameClass[True-3] PASSED [  3%]
02:13:06 test/integration/clitest/test_chgrp.py::TestChgrp::testMultipleSimpleObjectsSameClass[False-1] PASSED [  4%]
02:13:06 test/integration/clitest/test_chgrp.py::TestChgrp::testMultipleSimpleObjectsSameClass[False-2] PASSED [  4%]
02:13:06 test/integration/clitest/test_chgrp.py::TestChgrp::testMultipleSimpleObjectsSameClass[False-3] PASSED [  4%]
02:13:06 test/integration/clitest/test_chgrp.py::TestChgrp::testMultipleSimpleObjectsTwoClassesSeparated[True-1] PASSED [  4%]
02:13:06 test/integration/clitest/test_chgrp.py::TestChgrp::testMultipleSimpleObjectsTwoClassesSeparated[True-2] PASSED [  4%]
02:13:06 test/integration/clitest/test_chgrp.py::TestChgrp::testMultipleSimpleObjectsTwoClassesSeparated[True-3] PASSED [  4%]
02:13:06 test/integration/clitest/test_chgrp.py::TestChgrp::testMultipleSimpleObjectsTwoClassesSeparated[False-1] PASSED [  4%]
02:13:06 test/integration/clitest/test_chgrp.py::TestChgrp::testMultipleSimpleObjectsTwoClassesSeparated[False-2] PASSED [  4%]
02:13:07 test/integration/clitest/test_chgrp.py::TestChgrp::testMultipleSimpleObjectsTwoClassesSeparated[False-3] PASSED [  4%]
02:13:07 test/integration/clitest/test_chgrp.py::TestChgrp::testMultipleSimpleObjectsTwoClassesInterlaced[True-1] PASSED [  4%]
02:13:07 test/integration/clitest/test_chgrp.py::TestChgrp::testMultipleSimpleObjectsTwoClassesInterlaced[True-2] PASSED [  4%]
02:13:07 test/integration/clitest/test_chgrp.py::TestChgrp::testMultipleSimpleObjectsTwoClassesInterlaced[True-3] PASSED [  4%]
02:13:07 test/integration/clitest/test_chgrp.py::TestChgrp::testMultipleSimpleObjectsTwoClassesInterlaced[False-1] PASSED [  4%]
02:13:07 test/integration/clitest/test_chgrp.py::TestChgrp::testMultipleSimpleObjectsTwoClassesInterlaced[False-2] PASSED [  4%]
02:13:08 test/integration/clitest/test_chgrp.py::TestChgrp::testMultipleSimpleObjectsTwoClassesInterlaced[False-3] PASSED [  4%]
02:13:08 test/integration/clitest/test_chgrp.py::TestChgrp::testBasicSkipheadBothForms[True-1-/Dataset] PASSED [  4%]
02:13:08 test/integration/clitest/test_chgrp.py::TestChgrp::testBasicSkipheadBothForms[True-1-] PASSED [  4%]
02:13:08 test/integration/clitest/test_chgrp.py::TestChgrp::testBasicSkipheadBothForms[True-2-/Dataset] PASSED [  4%]
02:13:08 test/integration/clitest/test_chgrp.py::TestChgrp::testBasicSkipheadBothForms[True-2-] PASSED [  4%]
02:13:09 test/integration/clitest/test_chgrp.py::TestChgrp::testBasicSkipheadBothForms[False-1-/Dataset] PASSED [  4%]
02:13:09 test/integration/clitest/test_chgrp.py::TestChgrp::testBasicSkipheadBothForms[False-1-] PASSED [  4%]
02:13:09 test/integration/clitest/test_chgrp.py::TestChgrp::testBasicSkipheadBothForms[False-2-/Dataset] PASSED [  5%]
02:13:09 test/integration/clitest/test_chgrp.py::TestChgrp::testBasicSkipheadBothForms[False-2-] PASSED [  5%]
02:13:09 test/integration/clitest/test_chgrp.py::TestChgrp::testMultipleSkipheadsSameClass[True-1] PASSED [  5%]
02:13:10 test/integration/clitest/test_chgrp.py::TestChgrp::testMultipleSkipheadsSameClass[True-2] PASSED [  5%]
02:13:10 test/integration/clitest/test_chgrp.py::TestChgrp::testMultipleSkipheadsSameClass[True-3] PASSED [  5%]
02:13:10 test/integration/clitest/test_chgrp.py::TestChgrp::testMultipleSkipheadsSameClass[False-1] PASSED [  5%]
02:13:11 test/integration/clitest/test_chgrp.py::TestChgrp::testMultipleSkipheadsSameClass[False-2] PASSED [  5%]
02:13:11 test/integration/clitest/test_chgrp.py::TestChgrp::testMultipleSkipheadsSameClass[False-3] PASSED [  5%]
02:13:11 test/integration/clitest/test_chgrp.py::TestChgrp::testMultipleSkipheadsPlusObjectsSeparated[True-1] PASSED [  5%]
02:13:12 test/integration/clitest/test_chgrp.py::TestChgrp::testMultipleSkipheadsPlusObjectsSeparated[True-2] PASSED [  5%]
02:13:12 test/integration/clitest/test_chgrp.py::TestChgrp::testMultipleSkipheadsPlusObjectsSeparated[True-3] PASSED [  5%]
02:13:12 test/integration/clitest/test_chgrp.py::TestChgrp::testMultipleSkipheadsPlusObjectsSeparated[False-1] PASSED [  5%]
02:13:13 test/integration/clitest/test_chgrp.py::TestChgrp::testMultipleSkipheadsPlusObjectsSeparated[False-2] PASSED [  5%]
02:13:13 test/integration/clitest/test_chgrp.py::TestChgrp::testMultipleSkipheadsPlusObjectsSeparated[False-3] PASSED [  5%]
02:13:13 test/integration/clitest/test_chgrp.py::TestChgrp::testMultipleSkipheadsPlusObjectsInterlaced[True-1] PASSED [  5%]
02:13:14 test/integration/clitest/test_chgrp.py::TestChgrp::testMultipleSkipheadsPlusObjectsInterlaced[True-2] PASSED [  5%]
02:13:14 test/integration/clitest/test_chgrp.py::TestChgrp::testMultipleSkipheadsPlusObjectsInterlaced[True-3] PASSED [  5%]
02:13:14 test/integration/clitest/test_chgrp.py::TestChgrp::testMultipleSkipheadsPlusObjectsInterlaced[False-1] PASSED [  5%]
02:13:15 test/integration/clitest/test_chgrp.py::TestChgrp::testMultipleSkipheadsPlusObjectsInterlaced[False-2] PASSED [  5%]
02:13:15 test/integration/clitest/test_chgrp.py::TestChgrp::testMultipleSkipheadsPlusObjectsInterlaced[False-3] PASSED [  5%]
02:13:18 test/integration/clitest/test_chgrp.py::TestChgrpRoot::testNonMember PASSED [  6%]
02:13:21 test/integration/clitest/test_chown.py::TestChown::testChownBasicUsageWithId[-Image] PASSED [  6%]
02:13:23 test/integration/clitest/test_chown.py::TestChown::testChownBasicUsageWithId[-Dataset] PASSED [  6%]
02:13:26 test/integration/clitest/test_chown.py::TestChown::testChownBasicUsageWithId[-Project] PASSED [  6%]
02:13:27 test/integration/clitest/test_chown.py::TestChown::testChownBasicUsageWithId[-Plate] PASSED [  6%]
02:13:29 test/integration/clitest/test_chown.py::TestChown::testChownBasicUsageWithId[-Screen] PASSED [  6%]
02:13:31 test/integration/clitest/test_chown.py::TestChown::testChownBasicUsageWithId[User:-Image] PASSED [  6%]
02:13:33 test/integration/clitest/test_chown.py::TestChown::testChownBasicUsageWithId[User:-Dataset] PASSED [  6%]
02:13:35 test/integration/clitest/test_chown.py::TestChown::testChownBasicUsageWithId[User:-Project] PASSED [  6%]
02:13:37 test/integration/clitest/test_chown.py::TestChown::testChownBasicUsageWithId[User:-Plate] PASSED [  6%]
02:13:39 test/integration/clitest/test_chown.py::TestChown::testChownBasicUsageWithId[User:-Screen] PASSED [  6%]
02:13:41 test/integration/clitest/test_chown.py::TestChown::testChownBasicUsageWithId[Experimenter:-Image] PASSED [  6%]
02:13:43 test/integration/clitest/test_chown.py::TestChown::testChownBasicUsageWithId[Experimenter:-Dataset] PASSED [  6%]
02:13:45 test/integration/clitest/test_chown.py::TestChown::testChownBasicUsageWithId[Experimenter:-Project] PASSED [  6%]
02:13:47 test/integration/clitest/test_chown.py::TestChown::testChownBasicUsageWithId[Experimenter:-Plate] PASSED [  6%]
02:13:49 test/integration/clitest/test_chown.py::TestChown::testChownBasicUsageWithId[Experimenter:-Screen] PASSED [  6%]
02:13:53 test/integration/clitest/test_chown.py::TestChown::testChownBasicUsageTargetUser PASSED [  6%]
02:13:55 test/integration/clitest/test_chown.py::TestChown::testChownBasicUsageWithName[-] PASSED [  6%]
02:13:57 test/integration/clitest/test_chown.py::TestChown::testChownBasicUsageWithName[-/] PASSED [  6%]
02:13:59 test/integration/clitest/test_chown.py::TestChown::testChownBasicUsageWithName[I-] PASSED [  6%]
02:14:01 test/integration/clitest/test_chown.py::TestChown::testChownBasicUsageWithName[I-/] PASSED [  7%]
02:14:03 test/integration/clitest/test_chown.py::TestChown::testChownDifferentGroup PASSED [  7%]
02:14:08 test/integration/clitest/test_chown.py::TestChown::testFileset[image-1] PASSED [  7%]
02:14:14 test/integration/clitest/test_chown.py::TestChown::testFileset[image-2] PASSED [  7%]
02:14:19 test/integration/clitest/test_chown.py::TestChown::testFileset[fileset-1] PASSED [  7%]
02:14:25 test/integration/clitest/test_chown.py::TestChown::testFileset[fileset-2] PASSED [  7%]
02:14:31 test/integration/clitest/test_chown.py::TestChown::testFilesetPartialFailing PASSED [  7%]
02:14:37 test/integration/clitest/test_chown.py::TestChown::testFilesetAllImagesChownDataset PASSED [  7%]
02:14:40 test/integration/clitest/test_chown.py::TestChown::testMultipleSimpleObjectsSameClass[True-1] PASSED [  7%]
02:14:41 test/integration/clitest/test_chown.py::TestChown::testMultipleSimpleObjectsSameClass[True-2] PASSED [  7%]
02:14:44 test/integration/clitest/test_chown.py::TestChown::testMultipleSimpleObjectsSameClass[True-3] PASSED [  7%]
02:14:46 test/integration/clitest/test_chown.py::TestChown::testMultipleSimpleObjectsSameClass[False-1] PASSED [  7%]
02:14:48 test/integration/clitest/test_chown.py::TestChown::testMultipleSimpleObjectsSameClass[False-2] PASSED [  7%]
02:14:50 test/integration/clitest/test_chown.py::TestChown::testMultipleSimpleObjectsSameClass[False-3] PASSED [  7%]
02:14:52 test/integration/clitest/test_chown.py::TestChown::testMultipleSimpleObjectsTwoClassesSeparated[True-1] PASSED [  7%]
02:14:54 test/integration/clitest/test_chown.py::TestChown::testMultipleSimpleObjectsTwoClassesSeparated[True-2] PASSED [  7%]
02:14:56 test/integration/clitest/test_chown.py::TestChown::testMultipleSimpleObjectsTwoClassesSeparated[True-3] PASSED [  7%]
02:14:58 test/integration/clitest/test_chown.py::TestChown::testMultipleSimpleObjectsTwoClassesSeparated[False-1] PASSED [  7%]
02:15:00 test/integration/clitest/test_chown.py::TestChown::testMultipleSimpleObjectsTwoClassesSeparated[False-2] PASSED [  7%]
02:15:02 test/integration/clitest/test_chown.py::TestChown::testMultipleSimpleObjectsTwoClassesSeparated[False-3] PASSED [  7%]
02:15:04 test/integration/clitest/test_chown.py::TestChown::testMultipleSimpleObjectsTwoClassesInterlaced[True-1] PASSED [  8%]
02:15:06 test/integration/clitest/test_chown.py::TestChown::testMultipleSimpleObjectsTwoClassesInterlaced[True-2] PASSED [  8%]
02:15:09 test/integration/clitest/test_chown.py::TestChown::testMultipleSimpleObjectsTwoClassesInterlaced[True-3] PASSED [  8%]
02:15:11 test/integration/clitest/test_chown.py::TestChown::testMultipleSimpleObjectsTwoClassesInterlaced[False-1] PASSED [  8%]
02:15:13 test/integration/clitest/test_chown.py::TestChown::testMultipleSimpleObjectsTwoClassesInterlaced[False-2] PASSED [  8%]
02:15:15 test/integration/clitest/test_chown.py::TestChown::testMultipleSimpleObjectsTwoClassesInterlaced[False-3] PASSED [  8%]
02:15:18 test/integration/clitest/test_chown.py::TestChown::testBasicSkipheadBothForms[True-1-/Dataset] PASSED [  8%]
02:15:20 test/integration/clitest/test_chown.py::TestChown::testBasicSkipheadBothForms[True-1-] PASSED [  8%]
02:15:22 test/integration/clitest/test_chown.py::TestChown::testBasicSkipheadBothForms[True-2-/Dataset] PASSED [  8%]
02:15:24 test/integration/clitest/test_chown.py::TestChown::testBasicSkipheadBothForms[True-2-] PASSED [  8%]
02:15:26 test/integration/clitest/test_chown.py::TestChown::testBasicSkipheadBothForms[False-1-/Dataset] PASSED [  8%]
02:15:29 test/integration/clitest/test_chown.py::TestChown::testBasicSkipheadBothForms[False-1-] PASSED [  8%]
02:15:31 test/integration/clitest/test_chown.py::TestChown::testBasicSkipheadBothForms[False-2-/Dataset] PASSED [  8%]
02:15:33 test/integration/clitest/test_chown.py::TestChown::testBasicSkipheadBothForms[False-2-] PASSED [  8%]
02:15:35 test/integration/clitest/test_chown.py::TestChown::testMultipleSkipheadsPlusObjectsSeparated[True-1] PASSED [  8%]
02:15:37 test/integration/clitest/test_chown.py::TestChown::testMultipleSkipheadsPlusObjectsSeparated[True-2] PASSED [  8%]
02:15:40 test/integration/clitest/test_chown.py::TestChown::testMultipleSkipheadsPlusObjectsSeparated[True-3] PASSED [  8%]
02:15:42 test/integration/clitest/test_chown.py::TestChown::testMultipleSkipheadsPlusObjectsSeparated[False-1] PASSED [  8%]
02:15:45 test/integration/clitest/test_chown.py::TestChown::testMultipleSkipheadsPlusObjectsSeparated[False-2] PASSED [  8%]
02:15:47 test/integration/clitest/test_chown.py::TestChown::testMultipleSkipheadsPlusObjectsSeparated[False-3] PASSED [  8%]
02:15:50 test/integration/clitest/test_chown.py::TestChown::testMultipleSkipheadsPlusObjectsInterlaced[True-1] PASSED [  8%]
02:15:52 test/integration/clitest/test_chown.py::TestChown::testMultipleSkipheadsPlusObjectsInterlaced[True-2] PASSED [  9%]
02:15:55 test/integration/clitest/test_chown.py::TestChown::testMultipleSkipheadsPlusObjectsInterlaced[True-3] PASSED [  9%]
02:15:57 test/integration/clitest/test_chown.py::TestChown::testMultipleSkipheadsPlusObjectsInterlaced[False-1] PASSED [  9%]
02:15:59 test/integration/clitest/test_chown.py::TestChown::testMultipleSkipheadsPlusObjectsInterlaced[False-2] PASSED [  9%]
02:16:02 test/integration/clitest/test_chown.py::TestChown::testMultipleSkipheadsPlusObjectsInterlaced[False-3] PASSED [  9%]
02:16:04 test/integration/clitest/test_chown.py::TestChown::testDryRun PASSED     [  9%]
02:16:06 test/integration/clitest/test_chown.py::TestChown::testExcludeNone PASSED [  9%]
02:16:09 test/integration/clitest/test_chown.py::TestChown::testExcludeDataset PASSED [  9%]
02:16:11 test/integration/clitest/test_chown.py::TestChown::testExcludeImage PASSED [  9%]
02:16:13 test/integration/clitest/test_chown.py::TestChown::testExcludeOverridesInclude PASSED [  9%]
02:16:15 test/integration/clitest/test_chown.py::TestChown::testSeparateAnnotationTransfer PASSED [  9%]
02:16:17 test/integration/clitest/test_chown.py::TestChown::testOutputWithElision PASSED [  9%]
02:16:21 test/integration/clitest/test_chown.py::TestTagChown::testChownOneTagSetWithUniqueTags PASSED [  9%]
02:16:26 test/integration/clitest/test_chown.py::TestChownRoot::testChownBasicUsageWithId PASSED [  9%]
02:16:30 test/integration/clitest/test_chown.py::TestChownNonGroupOwner::testChownBasicUsageWithId PASSED [  9%]
02:16:31 test/integration/clitest/test_cleanse.py::TestCleanse::testCleanseAdminOnly PASSED [  9%]
02:16:44 test/integration/clitest/test_cleanse.py::TestCleanseFullAdmin::testCleanseBasic PASSED [  9%]
02:17:04 test/integration/clitest/test_cleanse.py::TestCleanseFullAdmin::testCleanseNonsenseName PASSED [  9%]
02:17:06 test/integration/clitest/test_cleanse.py::TestCleanseRestrictedAdmin::test_cleanse_restricted_admin PASSED [  9%]
02:17:08 test/integration/clitest/test_cleanse.py::TestFixPyramids::test_fixpyramids_admin_only PASSED [  9%]
02:17:10 test/integration/clitest/test_cleanse.py::TestFixPyramidsRestrictedAdmin::test_fixpyramids_restricted_admin PASSED [ 10%]
02:17:11 test/integration/clitest/test_db.py::TestDatabase::testBadVersionDies PASSED [ 10%]
02:17:11 test/integration/clitest/test_db.py::TestDatabase::testPasswordIsAskedForAgainIfDiffer PASSED [ 10%]
02:17:12 test/integration/clitest/test_db.py::TestDatabase::testPasswordIsAskedForAgainIfEmpty PASSED [ 10%]
02:17:12 test/integration/clitest/test_db.py::TestDatabase::testPassword[--] PASSED [ 10%]
02:17:12 test/integration/clitest/test_db.py::TestDatabase::testPassword[----no-salt] PASSED [ 10%]
02:17:13 test/integration/clitest/test_db.py::TestDatabase::testPassword[-0-] PASSED [ 10%]
02:17:13 test/integration/clitest/test_db.py::TestDatabase::testPassword[-0---no-salt] PASSED [ 10%]
02:17:14 test/integration/clitest/test_db.py::TestDatabase::testPassword[-1-] PASSED [ 10%]
02:17:14 test/integration/clitest/test_db.py::TestDatabase::testPassword[-1---no-salt] PASSED [ 10%]
02:17:15 test/integration/clitest/test_db.py::TestDatabase::testPassword[ome--] PASSED [ 10%]
02:17:15 test/integration/clitest/test_db.py::TestDatabase::testPassword[ome----no-salt] PASSED [ 10%]
02:17:15 test/integration/clitest/test_db.py::TestDatabase::testPassword[ome-0-] PASSED [ 10%]
02:17:16 test/integration/clitest/test_db.py::TestDatabase::testPassword[ome-0---no-salt] PASSED [ 10%]
02:17:16 test/integration/clitest/test_db.py::TestDatabase::testPassword[ome-1-] PASSED [ 10%]
02:17:17 test/integration/clitest/test_db.py::TestDatabase::testPassword[ome-1---no-salt] PASSED [ 10%]
02:17:18 test/integration/clitest/test_db.py::TestDatabase::testScript[--] PASSED [ 10%]
02:17:19 test/integration/clitest/test_db.py::TestDatabase::testScript[---f] PASSED [ 10%]
02:17:20 test/integration/clitest/test_db.py::TestDatabase::testScript[----file] PASSED [ 10%]
02:17:21 test/integration/clitest/test_db.py::TestDatabase::testScript[---no-salt-] PASSED [ 10%]
02:17:22 test/integration/clitest/test_db.py::TestDatabase::testScript[---no-salt--f] PASSED [ 11%]
02:17:23 test/integration/clitest/test_db.py::TestDatabase::testScript[---no-salt---file] PASSED [ 11%]
02:17:24 test/integration/clitest/test_db.py::TestDatabase::testScript[--password ome--] PASSED [ 11%]
02:17:25 test/integration/clitest/test_db.py::TestDatabase::testScript[--password ome---f] PASSED [ 11%]
02:17:26 test/integration/clitest/test_db.py::TestDatabase::testScript[--password ome----file] PASSED [ 11%]
02:17:28 test/integration/clitest/test_db.py::TestDatabase::testScript[--password ome---no-salt-] PASSED [ 11%]
02:17:29 test/integration/clitest/test_db.py::TestDatabase::testScript[--password ome---no-salt--f] PASSED [ 11%]
02:17:30 test/integration/clitest/test_db.py::TestDatabase::testScript[--password ome---no-salt---file] PASSED [ 11%]
02:17:30 test/integration/clitest/test_db.py::TestDatabase::testScriptDeveloperArgs[%s %s %s--] PASSED [ 11%]
02:17:31 test/integration/clitest/test_db.py::TestDatabase::testScriptDeveloperArgs[%s %s %s---f] PASSED [ 11%]
02:17:31 test/integration/clitest/test_db.py::TestDatabase::testScriptDeveloperArgs[%s %s %s----file] PASSED [ 11%]
02:17:32 test/integration/clitest/test_db.py::TestDatabase::testScriptDeveloperArgs[%s %s %s---no-salt-] PASSED [ 11%]
02:17:32 test/integration/clitest/test_db.py::TestDatabase::testScriptDeveloperArgs[%s %s %s---no-salt--f] PASSED [ 11%]
02:17:32 test/integration/clitest/test_db.py::TestDatabase::testScriptDeveloperArgs[%s %s %s---no-salt---file] PASSED [ 11%]
02:17:33 test/integration/clitest/test_db.py::TestDatabase::testScriptDeveloperArgs[--version %s --patch %s --password %s--] PASSED [ 11%]
02:17:33 test/integration/clitest/test_db.py::TestDatabase::testScriptDeveloperArgs[--version %s --patch %s --password %s---f] PASSED [ 11%]
02:17:34 test/integration/clitest/test_db.py::TestDatabase::testScriptDeveloperArgs[--version %s --patch %s --password %s----file] PASSED [ 11%]
02:17:34 test/integration/clitest/test_db.py::TestDatabase::testScriptDeveloperArgs[--version %s --patch %s --password %s---no-salt-] PASSED [ 11%]
02:17:34 test/integration/clitest/test_db.py::TestDatabase::testScriptDeveloperArgs[--version %s --patch %s --password %s---no-salt--f] PASSED [ 11%]
02:17:35 test/integration/clitest/test_db.py::TestDatabase::testScriptDeveloperArgs[--version %s --patch %s --password %s---no-salt---file] PASSED [ 11%]
02:17:37 test/integration/clitest/test_delete.py::TestDelete::testDeleteMyData[Image-] PASSED [ 12%]
02:17:37 test/integration/clitest/test_delete.py::TestDelete::testDeleteMyData[Image-I] PASSED [ 12%]
02:17:37 test/integration/clitest/test_delete.py::TestDelete::testDeleteMyData[Dataset-] PASSED [ 12%]
02:17:37 test/integration/clitest/test_delete.py::TestDelete::testDeleteMyData[Dataset-I] PASSED [ 12%]
02:17:37 test/integration/clitest/test_delete.py::TestDelete::testDeleteMyData[Project-] PASSED [ 12%]
02:17:37 test/integration/clitest/test_delete.py::TestDelete::testDeleteMyData[Project-I] PASSED [ 12%]
02:17:37 test/integration/clitest/test_delete.py::TestDelete::testDeleteMyData[Plate-] PASSED [ 12%]
02:17:37 test/integration/clitest/test_delete.py::TestDelete::testDeleteMyData[Plate-I] PASSED [ 12%]
02:17:37 test/integration/clitest/test_delete.py::TestDelete::testDeleteMyData[Screen-] PASSED [ 12%]
02:17:37 test/integration/clitest/test_delete.py::TestDelete::testDeleteMyData[Screen-I] PASSED [ 12%]
02:17:41 test/integration/clitest/test_delete.py::TestDelete::testFileset[image-1] PASSED [ 12%]
02:17:44 test/integration/clitest/test_delete.py::TestDelete::testFileset[image-2] PASSED [ 12%]
02:17:48 test/integration/clitest/test_delete.py::TestDelete::testFileset[fileset-1] PASSED [ 12%]
02:17:51 test/integration/clitest/test_delete.py::TestDelete::testFileset[fileset-2] PASSED [ 12%]
02:17:55 test/integration/clitest/test_delete.py::TestDelete::testFilesetPartialFailing PASSED [ 12%]
02:17:58 test/integration/clitest/test_delete.py::TestDelete::testFilesetAllImagesDeleteDataset PASSED [ 12%]
02:17:58 test/integration/clitest/test_delete.py::TestDelete::testMultipleSimpleObjectsSameClass[True-1] PASSED [ 12%]
02:17:58 test/integration/clitest/test_delete.py::TestDelete::testMultipleSimpleObjectsSameClass[True-2] PASSED [ 12%]
02:17:58 test/integration/clitest/test_delete.py::TestDelete::testMultipleSimpleObjectsSameClass[True-3] PASSED [ 12%]
02:17:58 test/integration/clitest/test_delete.py::TestDelete::testMultipleSimpleObjectsSameClass[False-1] PASSED [ 12%]
02:17:58 test/integration/clitest/test_delete.py::TestDelete::testMultipleSimpleObjectsSameClass[False-2] PASSED [ 12%]
02:17:59 test/integration/clitest/test_delete.py::TestDelete::testMultipleSimpleObjectsSameClass[False-3] PASSED [ 13%]
02:17:59 test/integration/clitest/test_delete.py::TestDelete::testMultipleSimpleObjectsTwoClassesSeparated[True-1] PASSED [ 13%]
02:17:59 test/integration/clitest/test_delete.py::TestDelete::testMultipleSimpleObjectsTwoClassesSeparated[True-2] PASSED [ 13%]
02:17:59 test/integration/clitest/test_delete.py::TestDelete::testMultipleSimpleObjectsTwoClassesSeparated[True-3] PASSED [ 13%]
02:17:59 test/integration/clitest/test_delete.py::TestDelete::testMultipleSimpleObjectsTwoClassesSeparated[False-1] PASSED [ 13%]
02:17:59 test/integration/clitest/test_delete.py::TestDelete::testMultipleSimpleObjectsTwoClassesSeparated[False-2] PASSED [ 13%]
02:17:59 test/integration/clitest/test_delete.py::TestDelete::testMultipleSimpleObjectsTwoClassesSeparated[False-3] PASSED [ 13%]
02:17:59 test/integration/clitest/test_delete.py::TestDelete::testMultipleSimpleObjectsTwoClassesInterlaced[True-1] PASSED [ 13%]
02:17:59 test/integration/clitest/test_delete.py::TestDelete::testMultipleSimpleObjectsTwoClassesInterlaced[True-2] PASSED [ 13%]
02:18:00 test/integration/clitest/test_delete.py::TestDelete::testMultipleSimpleObjectsTwoClassesInterlaced[True-3] PASSED [ 13%]
02:18:00 test/integration/clitest/test_delete.py::TestDelete::testMultipleSimpleObjectsTwoClassesInterlaced[False-1] PASSED [ 13%]
02:18:00 test/integration/clitest/test_delete.py::TestDelete::testMultipleSimpleObjectsTwoClassesInterlaced[False-2] PASSED [ 13%]
02:18:00 test/integration/clitest/test_delete.py::TestDelete::testMultipleSimpleObjectsTwoClassesInterlaced[False-3] PASSED [ 13%]
02:18:00 test/integration/clitest/test_delete.py::TestDelete::testBasicSkipheadBothForms[True-1-/Dataset] PASSED [ 13%]
02:18:00 test/integration/clitest/test_delete.py::TestDelete::testBasicSkipheadBothForms[True-1-] PASSED [ 13%]
02:18:00 test/integration/clitest/test_delete.py::TestDelete::testBasicSkipheadBothForms[True-2-/Dataset] PASSED [ 13%]
02:18:01 test/integration/clitest/test_delete.py::TestDelete::testBasicSkipheadBothForms[True-2-] PASSED [ 13%]
02:18:01 test/integration/clitest/test_delete.py::TestDelete::testBasicSkipheadBothForms[False-1-/Dataset] PASSED [ 13%]
02:18:01 test/integration/clitest/test_delete.py::TestDelete::testBasicSkipheadBothForms[False-1-] PASSED [ 13%]
02:18:01 test/integration/clitest/test_delete.py::TestDelete::testBasicSkipheadBothForms[False-2-/Dataset] PASSED [ 13%]
02:18:01 test/integration/clitest/test_delete.py::TestDelete::testBasicSkipheadBothForms[False-2-] PASSED [ 14%]
02:18:01 test/integration/clitest/test_delete.py::TestDelete::testMultipleSkipheadsSameClass[True-1] PASSED [ 14%]
02:18:02 test/integration/clitest/test_delete.py::TestDelete::testMultipleSkipheadsSameClass[True-2] PASSED [ 14%]
02:18:02 test/integration/clitest/test_delete.py::TestDelete::testMultipleSkipheadsSameClass[True-3] PASSED [ 14%]
02:18:02 test/integration/clitest/test_delete.py::TestDelete::testMultipleSkipheadsSameClass[False-1] PASSED [ 14%]
02:18:02 test/integration/clitest/test_delete.py::TestDelete::testMultipleSkipheadsSameClass[False-2] PASSED [ 14%]
02:18:02 test/integration/clitest/test_delete.py::TestDelete::testMultipleSkipheadsSameClass[False-3] PASSED [ 14%]
02:18:03 test/integration/clitest/test_delete.py::TestDelete::testMultipleSkipheadsPlusObjectsSeparated[True-1] PASSED [ 14%]
02:18:03 test/integration/clitest/test_delete.py::TestDelete::testMultipleSkipheadsPlusObjectsSeparated[True-2] PASSED [ 14%]
02:18:03 test/integration/clitest/test_delete.py::TestDelete::testMultipleSkipheadsPlusObjectsSeparated[True-3] PASSED [ 14%]
02:18:03 test/integration/clitest/test_delete.py::TestDelete::testMultipleSkipheadsPlusObjectsSeparated[False-1] PASSED [ 14%]
02:18:04 test/integration/clitest/test_delete.py::TestDelete::testMultipleSkipheadsPlusObjectsSeparated[False-2] PASSED [ 14%]
02:18:04 test/integration/clitest/test_delete.py::TestDelete::testMultipleSkipheadsPlusObjectsSeparated[False-3] PASSED [ 14%]
02:18:04 test/integration/clitest/test_delete.py::TestDelete::testMultipleSkipheadsPlusObjectsInterlaced[True-1] PASSED [ 14%]
02:18:04 test/integration/clitest/test_delete.py::TestDelete::testMultipleSkipheadsPlusObjectsInterlaced[True-2] PASSED [ 14%]
02:18:05 test/integration/clitest/test_delete.py::TestDelete::testMultipleSkipheadsPlusObjectsInterlaced[True-3] PASSED [ 14%]
02:18:05 test/integration/clitest/test_delete.py::TestDelete::testMultipleSkipheadsPlusObjectsInterlaced[False-1] PASSED [ 14%]
02:18:05 test/integration/clitest/test_delete.py::TestDelete::testMultipleSkipheadsPlusObjectsInterlaced[False-2] PASSED [ 14%]
02:18:05 test/integration/clitest/test_delete.py::TestDelete::testMultipleSkipheadsPlusObjectsInterlaced[False-3] PASSED [ 14%]
02:18:05 test/integration/clitest/test_delete.py::TestDelete::testDryRun PASSED   [ 14%]
02:18:05 test/integration/clitest/test_delete.py::TestDelete::testExcludeNone PASSED [ 15%]
02:18:06 test/integration/clitest/test_delete.py::TestDelete::testExcludeDataset PASSED [ 15%]
02:18:06 test/integration/clitest/test_delete.py::TestDelete::testExcludeImage PASSED [ 15%]
02:18:06 test/integration/clitest/test_delete.py::TestDelete::testExcludeOverridesInclude PASSED [ 15%]
02:18:06 test/integration/clitest/test_delete.py::TestDelete::testDefaultExclusion PASSED [ 15%]
02:18:06 test/integration/clitest/test_delete.py::TestDelete::testDefaultExclusionOverride PASSED [ 15%]
02:18:06 test/integration/clitest/test_delete.py::TestDelete::testDefaultExclusionPartialOverride PASSED [ 15%]
02:18:07 test/integration/clitest/test_delete.py::TestDelete::testSeparateAnnotationDelete PASSED [ 15%]
02:18:07 test/integration/clitest/test_delete.py::TestDelete::testLinkedAnnotationDelete PASSED [ 15%]
02:18:07 test/integration/clitest/test_delete.py::TestDelete::testLinkedAnnotationDeleteWithOverride PASSED [ 15%]
02:18:07 test/integration/clitest/test_delete.py::TestDelete::testInputWithElisionDefault[1] PASSED [ 15%]
02:18:07 test/integration/clitest/test_delete.py::TestDelete::testInputWithElisionDefault[2] PASSED [ 15%]
02:18:07 test/integration/clitest/test_delete.py::TestDelete::testInputWithElisionDefault[3] PASSED [ 15%]
02:18:07 test/integration/clitest/test_delete.py::TestDelete::testInputWithElisionForce PASSED [ 15%]
02:18:09 test/integration/clitest/test_delete.py::TestDelete::testElisionDefaultFailForce PASSED [ 15%]
02:18:35 test/integration/clitest/test_delete.py::TestDelete::testOutputWithElision PASSED [ 15%]
02:18:37 test/integration/clitest/test_delete.py::TestTagDelete::testDeleteOneTagSetNotTags PASSED [ 15%]
02:18:38 test/integration/clitest/test_delete.py::TestTagDelete::testDeleteTwoTagSetsNotTags PASSED [ 15%]
02:18:38 test/integration/clitest/test_delete.py::TestTagDelete::testDeleteOneTagSetIncludingTags PASSED [ 15%]
02:18:38 test/integration/clitest/test_delete.py::TestTagDelete::testDeleteTwoTagSetsIncludingTags PASSED [ 15%]
02:18:40 test/integration/clitest/test_download.py::TestDownload::testNonExistingOriginalFile[] PASSED [ 16%]
02:18:40 test/integration/clitest/test_download.py::TestDownload::testNonExistingOriginalFile[OriginalFile:] PASSED [ 16%]
02:18:40 test/integration/clitest/test_download.py::TestDownload::testOriginalFileTmpfile[] PASSED [ 16%]
02:18:40 test/integration/clitest/test_download.py::TestDownload::testOriginalFileTmpfile[OriginalFile:] PASSED [ 16%]
02:18:40 test/integration/clitest/test_download.py::TestDownload::testOriginalFileStdout[] PASSED [ 16%]
02:18:40 test/integration/clitest/test_download.py::TestDownload::testOriginalFileStdout[OriginalFile:] PASSED [ 16%]
02:18:42 test/integration/clitest/test_download.py::TestDownload::testOriginalFileMultipleGroups[] PASSED [ 16%]
02:18:44 test/integration/clitest/test_download.py::TestDownload::testOriginalFileMultipleGroups[OriginalFile:] PASSED [ 16%]
02:18:44 test/integration/clitest/test_download.py::TestDownload::testNonExistingFileAnnotation PASSED [ 16%]
02:18:44 test/integration/clitest/test_download.py::TestDownload::testFileAnnotationTmpfile PASSED [ 16%]
02:18:44 test/integration/clitest/test_download.py::TestDownload::testFileAnnotationStdout PASSED [ 16%]
02:18:46 test/integration/clitest/test_download.py::TestDownload::testFileAnnotationMultipleGroups PASSED [ 16%]
02:18:49 test/integration/clitest/test_download.py::TestDownload::testNonExistingImage PASSED [ 16%]
02:18:53 test/integration/clitest/test_download.py::TestDownload::testImageFileset[True] PASSED [ 16%]
02:18:56 test/integration/clitest/test_download.py::TestDownload::testImageFileset[False] PASSED [ 16%]
02:18:59 test/integration/clitest/test_download.py::TestDownload::testSingleImageWithCompanion PASSED [ 16%]
02:19:03 test/integration/clitest/test_download.py::TestDownload::testMIF PASSED  [ 16%]
02:19:03 test/integration/clitest/test_download.py::TestDownload::testImageNoFileset PASSED [ 16%]
02:19:09 test/integration/clitest/test_download.py::TestDownload::testImageMultipleGroups PASSED [ 16%]
02:19:09 test/integration/clitest/test_download.py::TestDownload::testValidPolicy PASSED [ 16%]
02:19:23 test/integration/clitest/test_download.py::TestDownload::testPolicyGlobalRestriction[+read,+write,+image] PASSED [ 16%]
02:19:23 test/integration/clitest/test_download.py::TestDownload::testPolicyGlobalRestriction[-read,-write,-image,-plate] SKIPPED [ 17%]
02:19:23 test/integration/clitest/test_download.py::TestDownload::testPolicyGlobalRestriction[-read,+write,+image,-plate] SKIPPED [ 17%]
02:19:23 test/integration/clitest/test_download.py::TestDownload::testPolicyGlobalRestriction[+read,+write,+image,-plate] SKIPPED [ 17%]
02:19:23 test/integration/clitest/test_download.py::TestDownload::testPolicyGlobalRestriction[+read,+write,+image,+plate] SKIPPED [ 17%]
02:19:37 test/integration/clitest/test_download.py::TestDownload::testPolicyGroupRestriction[+read,+write,+image] PASSED [ 17%]
02:19:51 test/integration/clitest/test_download.py::TestDownload::testPolicyGroupRestriction[-read,-write,-image,-plate] PASSED [ 17%]
02:20:05 test/integration/clitest/test_download.py::TestDownload::testPolicyGroupRestriction[-read,+write,+image,-plate] PASSED [ 17%]
02:20:19 test/integration/clitest/test_download.py::TestDownload::testPolicyGroupRestriction[+read,+write,+image,-plate] PASSED [ 17%]
02:20:32 test/integration/clitest/test_download.py::TestDownload::testPolicyGroupRestriction[+read,+write,+image,+plate] PASSED [ 17%]
02:20:34 test/integration/clitest/test_duplicate.py::TestDuplicate::testDuplicateSingleObject[Image-] PASSED [ 17%]
02:20:34 test/integration/clitest/test_duplicate.py::TestDuplicate::testDuplicateSingleObject[Image-I] PASSED [ 17%]
02:20:34 test/integration/clitest/test_duplicate.py::TestDuplicate::testDuplicateSingleObject[Dataset-] PASSED [ 17%]
02:20:34 test/integration/clitest/test_duplicate.py::TestDuplicate::testDuplicateSingleObject[Dataset-I] PASSED [ 17%]
02:20:34 test/integration/clitest/test_duplicate.py::TestDuplicate::testDuplicateSingleObject[Project-] PASSED [ 17%]
02:20:34 test/integration/clitest/test_duplicate.py::TestDuplicate::testDuplicateSingleObject[Project-I] PASSED [ 17%]
02:20:35 test/integration/clitest/test_duplicate.py::TestDuplicate::testDuplicateSingleObject[Plate-] PASSED [ 17%]
02:20:35 test/integration/clitest/test_duplicate.py::TestDuplicate::testDuplicateSingleObject[Plate-I] PASSED [ 17%]
02:20:35 test/integration/clitest/test_duplicate.py::TestDuplicate::testDuplicateSingleObject[Screen-] PASSED [ 17%]
02:20:35 test/integration/clitest/test_duplicate.py::TestDuplicate::testDuplicateSingleObject[Screen-I] PASSED [ 17%]
02:20:35 test/integration/clitest/test_duplicate.py::TestDuplicate::testDuplicateSingleObjectDryRun PASSED [ 17%]
02:20:35 test/integration/clitest/test_duplicate.py::TestDuplicate::testDuplicateSingleObjectReport PASSED [ 18%]
02:20:35 test/integration/clitest/test_duplicate.py::TestDuplicate::testDuplicateSingleObjectDryRunReport PASSED [ 18%]
02:20:35 test/integration/clitest/test_duplicate.py::TestDuplicate::testBasicHierarchyDuplication PASSED [ 18%]
02:20:35 test/integration/clitest/test_duplicate.py::TestDuplicate::testIgnoreLinks PASSED [ 18%]
02:20:36 test/integration/clitest/test_duplicate.py::TestDuplicate::testIgnoreLinksOverridden PASSED [ 18%]
02:20:36 test/integration/clitest/test_duplicate.py::TestDuplicate::testReferencing PASSED [ 18%]
02:20:36 test/integration/clitest/test_duplicate.py::TestDuplicate::testSkipheadDuplication PASSED [ 18%]
02:20:38 test/integration/clitest/test_fs.py::TestFS::testRepos PASSED            [ 18%]
02:20:58 test/integration/clitest/test_fs.py::TestFS::testSetsWithTransfer PASSED [ 18%]
02:20:58 test/integration/clitest/test_fs.py::TestFS::testSetsAdminOnly PASSED    [ 18%]
02:20:58 test/integration/clitest/test_fs.py::TestFS::testMkdirAdminOnly PASSED   [ 18%]
02:21:02 test/integration/clitest/test_fs.py::TestFS::testImportTime[all-True] PASSED [ 18%]
02:21:05 test/integration/clitest/test_fs.py::TestFS::testImportTime[all-False] PASSED [ 18%]
02:21:10 test/integration/clitest/test_fs.py::TestFS::testImportTime[minmax-True] PASSED [ 18%]
02:21:14 test/integration/clitest/test_fs.py::TestFS::testImportTime[minmax-False] PASSED [ 18%]
02:21:18 test/integration/clitest/test_fs.py::TestFS::testImportTime[thumbnails-True] PASSED [ 18%]
02:21:21 test/integration/clitest/test_fs.py::TestFS::testImportTime[thumbnails-False] PASSED [ 18%]
02:21:23 test/integration/clitest/test_fs.py::TestFsRoot::testMkdirAsAdminSimpleDirCreation PASSED [ 18%]
02:21:23 test/integration/clitest/test_fs.py::TestFsRoot::testMkdirAsAdminHierarchyOnlyPreexisting PASSED [ 18%]
02:21:24 test/integration/clitest/test_fs.py::TestFsRoot::testMkdirAsAdminHierarchyParents PASSED [ 18%]
02:21:33 test/integration/clitest/test_group.py::TestGroup::testList[None-None] PASSED [ 19%]
02:21:36 test/integration/clitest/test_group.py::TestGroup::testList[None-id] PASSED [ 19%]
02:21:39 test/integration/clitest/test_group.py::TestGroup::testList[None-name] PASSED [ 19%]
02:21:43 test/integration/clitest/test_group.py::TestGroup::testList[count-None] PASSED [ 19%]
02:21:46 test/integration/clitest/test_group.py::TestGroup::testList[count-id] PASSED [ 19%]
02:21:50 test/integration/clitest/test_group.py::TestGroup::testList[count-name] PASSED [ 19%]
02:21:53 test/integration/clitest/test_group.py::TestGroup::testList[long-None] PASSED [ 19%]
02:21:57 test/integration/clitest/test_group.py::TestGroup::testList[long-id] PASSED [ 19%]
02:22:00 test/integration/clitest/test_group.py::TestGroup::testList[long-name] PASSED [ 19%]
02:22:00 test/integration/clitest/test_group.py::TestGroup::testAddAdminOnly PASSED [ 19%]
02:22:00 test/integration/clitest/test_group.py::TestGroup::testInfoNoArgument PASSED [ 19%]
02:22:01 test/integration/clitest/test_group.py::TestGroup::testInfoArgument[id] PASSED [ 19%]
02:22:01 test/integration/clitest/test_group.py::TestGroup::testInfoArgument[name] PASSED [ 19%]
02:22:01 test/integration/clitest/test_group.py::TestGroup::testInfoArgument[--group-id] PASSED [ 19%]
02:22:01 test/integration/clitest/test_group.py::TestGroup::testInfoArgument[--group-name] PASSED [ 19%]
02:22:01 test/integration/clitest/test_group.py::TestGroup::testInfoInvalidGroup PASSED [ 19%]
02:22:01 test/integration/clitest/test_group.py::TestGroup::testListUsersNoArgument PASSED [ 19%]
02:22:01 test/integration/clitest/test_group.py::TestGroup::testListUsersArgument[id] PASSED [ 19%]
02:22:01 test/integration/clitest/test_group.py::TestGroup::testListUsersArgument[name] PASSED [ 19%]
02:22:01 test/integration/clitest/test_group.py::TestGroup::testListUsersArgument[--group-id] PASSED [ 19%]
02:22:01 test/integration/clitest/test_group.py::TestGroup::testListUsersArgument[--group-name] PASSED [ 20%]
02:22:01 test/integration/clitest/test_group.py::TestGroup::testListUsersInvalidArgument PASSED [ 20%]
02:22:03 test/integration/clitest/test_group.py::TestGroupRoot::testAddDefaults PASSED [ 20%]
02:22:03 test/integration/clitest/test_group.py::TestGroupRoot::testAddPerms[--perms-rw----] PASSED [ 20%]
02:22:03 test/integration/clitest/test_group.py::TestGroupRoot::testAddPerms[--perms-rwr---] PASSED [ 20%]
02:22:03 test/integration/clitest/test_group.py::TestGroupRoot::testAddPerms[--perms-rwra--] PASSED [ 20%]
02:22:03 test/integration/clitest/test_group.py::TestGroupRoot::testAddPerms[--perms-rwrw--] PASSED [ 20%]
02:22:03 test/integration/clitest/test_group.py::TestGroupRoot::testAddPerms[--type-private] PASSED [ 20%]
02:22:03 test/integration/clitest/test_group.py::TestGroupRoot::testAddPerms[--type-read-only] PASSED [ 20%]
02:22:03 test/integration/clitest/test_group.py::TestGroupRoot::testAddPerms[--type-read-annotate] PASSED [ 20%]
02:22:03 test/integration/clitest/test_group.py::TestGroupRoot::testAddPerms[--type-read-write] PASSED [ 20%]
02:22:03 test/integration/clitest/test_group.py::TestGroupRoot::testAddSameNamefails PASSED [ 20%]
02:22:03 test/integration/clitest/test_group.py::TestGroupRoot::testAddIgnoreExisting PASSED [ 20%]
02:22:03 test/integration/clitest/test_group.py::TestGroupRoot::testPerms[--perms-rw-----rw-------id] PASSED [ 20%]
02:22:03 test/integration/clitest/test_group.py::TestGroupRoot::testPerms[--perms-rw-----rw-------name] PASSED [ 20%]
02:22:04 test/integration/clitest/test_group.py::TestGroupRoot::testPerms[--perms-rw-----rwr------id] PASSED [ 20%]
02:22:05 test/integration/clitest/test_group.py::TestGroupRoot::testPerms[--perms-rw-----rwr------name] PASSED [ 20%]
02:22:06 test/integration/clitest/test_group.py::TestGroupRoot::testPerms[--perms-rw-----rwra-----id] PASSED [ 20%]
02:22:07 test/integration/clitest/test_group.py::TestGroupRoot::testPerms[--perms-rw-----rwra-----name] PASSED [ 20%]
02:22:08 test/integration/clitest/test_group.py::TestGroupRoot::testPerms[--perms-rw-----rwrw-----id] PASSED [ 20%]
02:22:09 test/integration/clitest/test_group.py::TestGroupRoot::testPerms[--perms-rw-----rwrw-----name] PASSED [ 20%]
02:22:09 test/integration/clitest/test_group.py::TestGroupRoot::testPerms[--perms-rwr----rw-------id] PASSED [ 21%]
02:22:09 test/integration/clitest/test_group.py::TestGroupRoot::testPerms[--perms-rwr----rw-------name] PASSED [ 21%]
02:22:09 test/integration/clitest/test_group.py::TestGroupRoot::testPerms[--perms-rwr----rwr------id] PASSED [ 21%]
02:22:09 test/integration/clitest/test_group.py::TestGroupRoot::testPerms[--perms-rwr----rwr------name] PASSED [ 21%]
02:22:10 test/integration/clitest/test_group.py::TestGroupRoot::testPerms[--perms-rwr----rwra-----id] PASSED [ 21%]
02:22:10 test/integration/clitest/test_group.py::TestGroupRoot::testPerms[--perms-rwr----rwra-----name] PASSED [ 21%]
02:22:10 test/integration/clitest/test_group.py::TestGroupRoot::testPerms[--perms-rwr----rwrw-----id] PASSED [ 21%]
02:22:10 test/integration/clitest/test_group.py::TestGroupRoot::testPerms[--perms-rwr----rwrw-----name] PASSED [ 21%]
02:22:11 test/integration/clitest/test_group.py::TestGroupRoot::testPerms[--perms-rwra---rw-------id] PASSED [ 21%]
02:22:11 test/integration/clitest/test_group.py::TestGroupRoot::testPerms[--perms-rwra---rw-------name] PASSED [ 21%]
02:22:11 test/integration/clitest/test_group.py::TestGroupRoot::testPerms[--perms-rwra---rwr------id] PASSED [ 21%]
02:22:11 test/integration/clitest/test_group.py::TestGroupRoot::testPerms[--perms-rwra---rwr------name] PASSED [ 21%]
02:22:11 test/integration/clitest/test_group.py::TestGroupRoot::testPerms[--perms-rwra---rwra-----id] PASSED [ 21%]
02:22:11 test/integration/clitest/test_group.py::TestGroupRoot::testPerms[--perms-rwra---rwra-----name] PASSED [ 21%]
02:22:12 test/integration/clitest/test_group.py::TestGroupRoot::testPerms[--perms-rwra---rwrw-----id] PASSED [ 21%]
02:22:12 test/integration/clitest/test_group.py::TestGroupRoot::testPerms[--perms-rwra---rwrw-----name] PASSED [ 21%]
02:22:12 test/integration/clitest/test_group.py::TestGroupRoot::testPerms[--perms-rwrw---rw-------id] PASSED [ 21%]
02:22:12 test/integration/clitest/test_group.py::TestGroupRoot::testPerms[--perms-rwrw---rw-------name] PASSED [ 21%]
02:22:12 test/integration/clitest/test_group.py::TestGroupRoot::testPerms[--perms-rwrw---rwr------id] PASSED [ 21%]
02:22:13 test/integration/clitest/test_group.py::TestGroupRoot::testPerms[--perms-rwrw---rwr------name] PASSED [ 21%]
02:22:13 test/integration/clitest/test_group.py::TestGroupRoot::testPerms[--perms-rwrw---rwra-----id] PASSED [ 22%]
02:22:13 test/integration/clitest/test_group.py::TestGroupRoot::testPerms[--perms-rwrw---rwra-----name] PASSED [ 22%]
02:22:13 test/integration/clitest/test_group.py::TestGroupRoot::testPerms[--perms-rwrw---rwrw-----id] PASSED [ 22%]
02:22:13 test/integration/clitest/test_group.py::TestGroupRoot::testPerms[--perms-rwrw---rwrw-----name] PASSED [ 22%]
02:22:13 test/integration/clitest/test_group.py::TestGroupRoot::testPerms[--type-private-rw-------id] PASSED [ 22%]
02:22:13 test/integration/clitest/test_group.py::TestGroupRoot::testPerms[--type-private-rw-------name] PASSED [ 22%]
02:22:14 test/integration/clitest/test_group.py::TestGroupRoot::testPerms[--type-private-rwr------id] PASSED [ 22%]
02:22:15 test/integration/clitest/test_group.py::TestGroupRoot::testPerms[--type-private-rwr------name] PASSED [ 22%]
02:22:16 test/integration/clitest/test_group.py::TestGroupRoot::testPerms[--type-private-rwra-----id] PASSED [ 22%]
02:22:17 test/integration/clitest/test_group.py::TestGroupRoot::testPerms[--type-private-rwra-----name] PASSED [ 22%]
02:22:18 test/integration/clitest/test_group.py::TestGroupRoot::testPerms[--type-private-rwrw-----id] PASSED [ 22%]
02:22:19 test/integration/clitest/test_group.py::TestGroupRoot::testPerms[--type-private-rwrw-----name] PASSED [ 22%]
02:22:19 test/integration/clitest/test_group.py::TestGroupRoot::testPerms[--type-read-only-rw-------id] PASSED [ 22%]
02:22:19 test/integration/clitest/test_group.py::TestGroupRoot::testPerms[--type-read-only-rw-------name] PASSED [ 22%]
02:22:19 test/integration/clitest/test_group.py::TestGroupRoot::testPerms[--type-read-only-rwr------id] PASSED [ 22%]
02:22:19 test/integration/clitest/test_group.py::TestGroupRoot::testPerms[--type-read-only-rwr------name] PASSED [ 22%]
02:22:19 test/integration/clitest/test_group.py::TestGroupRoot::testPerms[--type-read-only-rwra-----id] PASSED [ 22%]
02:22:20 test/integration/clitest/test_group.py::TestGroupRoot::testPerms[--type-read-only-rwra-----name] PASSED [ 22%]
02:22:20 test/integration/clitest/test_group.py::TestGroupRoot::testPerms[--type-read-only-rwrw-----id] PASSED [ 22%]
02:22:20 test/integration/clitest/test_group.py::TestGroupRoot::testPerms[--type-read-only-rwrw-----name] PASSED [ 22%]
02:22:20 test/integration/clitest/test_group.py::TestGroupRoot::testPerms[--type-read-annotate-rw-------id] PASSED [ 23%]
02:22:20 test/integration/clitest/test_group.py::TestGroupRoot::testPerms[--type-read-annotate-rw-------name] PASSED [ 23%]
02:22:21 test/integration/clitest/test_group.py::TestGroupRoot::testPerms[--type-read-annotate-rwr------id] PASSED [ 23%]
02:22:21 test/integration/clitest/test_group.py::TestGroupRoot::testPerms[--type-read-annotate-rwr------name] PASSED [ 23%]
02:22:21 test/integration/clitest/test_group.py::TestGroupRoot::testPerms[--type-read-annotate-rwra-----id] PASSED [ 23%]
02:22:21 test/integration/clitest/test_group.py::TestGroupRoot::testPerms[--type-read-annotate-rwra-----name] PASSED [ 23%]
02:22:21 test/integration/clitest/test_group.py::TestGroupRoot::testPerms[--type-read-annotate-rwrw-----id] PASSED [ 23%]
02:22:22 test/integration/clitest/test_group.py::TestGroupRoot::testPerms[--type-read-annotate-rwrw-----name] PASSED [ 23%]
02:22:22 test/integration/clitest/test_group.py::TestGroupRoot::testPerms[--type-read-write-rw-------id] PASSED [ 23%]
02:22:22 test/integration/clitest/test_group.py::TestGroupRoot::testPerms[--type-read-write-rw-------name] PASSED [ 23%]
02:22:22 test/integration/clitest/test_group.py::TestGroupRoot::testPerms[--type-read-write-rwr------id] PASSED [ 23%]
02:22:22 test/integration/clitest/test_group.py::TestGroupRoot::testPerms[--type-read-write-rwr------name] PASSED [ 23%]
02:22:23 test/integration/clitest/test_group.py::TestGroupRoot::testPerms[--type-read-write-rwra-----id] PASSED [ 23%]
02:22:23 test/integration/clitest/test_group.py::TestGroupRoot::testPerms[--type-read-write-rwra-----name] PASSED [ 23%]
02:22:23 test/integration/clitest/test_group.py::TestGroupRoot::testPerms[--type-read-write-rwrw-----id] PASSED [ 23%]
02:22:23 test/integration/clitest/test_group.py::TestGroupRoot::testPerms[--type-read-write-rwrw-----name] PASSED [ 23%]
02:22:25 test/integration/clitest/test_group.py::TestGroupRoot::testAddUser[None-id---id] PASSED [ 23%]
02:22:27 test/integration/clitest/test_group.py::TestGroupRoot::testAddUser[None-id---name] PASSED [ 23%]
02:22:29 test/integration/clitest/test_group.py::TestGroupRoot::testAddUser[None-omeName---id] PASSED [ 23%]
02:22:30 test/integration/clitest/test_group.py::TestGroupRoot::testAddUser[None-omeName---name] PASSED [ 23%]
02:22:32 test/integration/clitest/test_group.py::TestGroupRoot::testAddUser[None---user-id---id] PASSED [ 24%]
02:22:34 test/integration/clitest/test_group.py::TestGroupRoot::testAddUser[None---user-id---name] PASSED [ 24%]
02:22:36 test/integration/clitest/test_group.py::TestGroupRoot::testAddUser[None---user-name---id] PASSED [ 24%]
02:22:38 test/integration/clitest/test_group.py::TestGroupRoot::testAddUser[None---user-name---name] PASSED [ 24%]
02:22:40 test/integration/clitest/test_group.py::TestGroupRoot::testAddUser[--as-owner-id---id] PASSED [ 24%]
02:22:42 test/integration/clitest/test_group.py::TestGroupRoot::testAddUser[--as-owner-id---name] PASSED [ 24%]
02:22:44 test/integration/clitest/test_group.py::TestGroupRoot::testAddUser[--as-owner-omeName---id] PASSED [ 24%]
02:22:45 test/integration/clitest/test_group.py::TestGroupRoot::testAddUser[--as-owner-omeName---name] PASSED [ 24%]
02:22:47 test/integration/clitest/test_group.py::TestGroupRoot::testAddUser[--as-owner---user-id---id] PASSED [ 24%]
02:22:49 test/integration/clitest/test_group.py::TestGroupRoot::testAddUser[--as-owner---user-id---name] PASSED [ 24%]
02:22:51 test/integration/clitest/test_group.py::TestGroupRoot::testAddUser[--as-owner---user-name---id] PASSED [ 24%]
02:22:53 test/integration/clitest/test_group.py::TestGroupRoot::testAddUser[--as-owner---user-name---name] PASSED [ 24%]
02:22:55 test/integration/clitest/test_group.py::TestGroupRoot::testRemoveUser[None-True-id---id] PASSED [ 24%]
02:22:57 test/integration/clitest/test_group.py::TestGroupRoot::testRemoveUser[None-True-id---name] PASSED [ 24%]
02:22:58 test/integration/clitest/test_group.py::TestGroupRoot::testRemoveUser[None-True-omeName---id] PASSED [ 24%]
02:23:00 test/integration/clitest/test_group.py::TestGroupRoot::testRemoveUser[None-True-omeName---name] PASSED [ 24%]
02:23:02 test/integration/clitest/test_group.py::TestGroupRoot::testRemoveUser[None-True---user-id---id] PASSED [ 24%]
02:23:04 test/integration/clitest/test_group.py::TestGroupRoot::testRemoveUser[None-True---user-id---name] PASSED [ 24%]
02:23:06 test/integration/clitest/test_group.py::TestGroupRoot::testRemoveUser[None-True---user-name---id] PASSED [ 24%]
02:23:08 test/integration/clitest/test_group.py::TestGroupRoot::testRemoveUser[None-True---user-name---name] PASSED [ 24%]
02:23:10 test/integration/clitest/test_group.py::TestGroupRoot::testRemoveUser[None-False-id---id] PASSED [ 24%]
02:23:12 test/integration/clitest/test_group.py::TestGroupRoot::testRemoveUser[None-False-id---name] PASSED [ 25%]
02:23:14 test/integration/clitest/test_group.py::TestGroupRoot::testRemoveUser[None-False-omeName---id] PASSED [ 25%]
02:23:15 test/integration/clitest/test_group.py::TestGroupRoot::testRemoveUser[None-False-omeName---name] PASSED [ 25%]
02:23:17 test/integration/clitest/test_group.py::TestGroupRoot::testRemoveUser[None-False---user-id---id] PASSED [ 25%]
02:23:19 test/integration/clitest/test_group.py::TestGroupRoot::testRemoveUser[None-False---user-id---name] PASSED [ 25%]
02:23:21 test/integration/clitest/test_group.py::TestGroupRoot::testRemoveUser[None-False---user-name---id] PASSED [ 25%]
02:23:23 test/integration/clitest/test_group.py::TestGroupRoot::testRemoveUser[None-False---user-name---name] PASSED [ 25%]
02:23:25 test/integration/clitest/test_group.py::TestGroupRoot::testRemoveUser[--as-owner-True-id---id] PASSED [ 25%]
02:23:27 test/integration/clitest/test_group.py::TestGroupRoot::testRemoveUser[--as-owner-True-id---name] PASSED [ 25%]
02:23:29 test/integration/clitest/test_group.py::TestGroupRoot::testRemoveUser[--as-owner-True-omeName---id] PASSED [ 25%]
02:23:31 test/integration/clitest/test_group.py::TestGroupRoot::testRemoveUser[--as-owner-True-omeName---name] PASSED [ 25%]
02:23:33 test/integration/clitest/test_group.py::TestGroupRoot::testRemoveUser[--as-owner-True---user-id---id] PASSED [ 25%]
02:23:34 test/integration/clitest/test_group.py::TestGroupRoot::testRemoveUser[--as-owner-True---user-id---name] PASSED [ 25%]
02:23:36 test/integration/clitest/test_group.py::TestGroupRoot::testRemoveUser[--as-owner-True---user-name---id] PASSED [ 25%]
02:23:38 test/integration/clitest/test_group.py::TestGroupRoot::testRemoveUser[--as-owner-True---user-name---name] PASSED [ 25%]
02:23:40 test/integration/clitest/test_group.py::TestGroupRoot::testRemoveUser[--as-owner-False-id---id] PASSED [ 25%]
02:23:42 test/integration/clitest/test_group.py::TestGroupRoot::testRemoveUser[--as-owner-False-id---name] PASSED [ 25%]
02:23:44 test/integration/clitest/test_group.py::TestGroupRoot::testRemoveUser[--as-owner-False-omeName---id] PASSED [ 25%]
02:23:46 test/integration/clitest/test_group.py::TestGroupRoot::testRemoveUser[--as-owner-False-omeName---name] PASSED [ 25%]
02:23:48 test/integration/clitest/test_group.py::TestGroupRoot::testRemoveUser[--as-owner-False---user-id---id] PASSED [ 25%]
02:23:50 test/integration/clitest/test_group.py::TestGroupRoot::testRemoveUser[--as-owner-False---user-id---name] PASSED [ 26%]
02:23:52 test/integration/clitest/test_group.py::TestGroupRoot::testRemoveUser[--as-owner-False---user-name---id] PASSED [ 26%]
02:23:54 test/integration/clitest/test_group.py::TestGroupRoot::testRemoveUser[--as-owner-False---user-name---name] PASSED [ 26%]
02:24:01 test/integration/clitest/test_group.py::TestGroupRoot::testCopyUsers[None-id-id] PASSED [ 26%]
02:24:09 test/integration/clitest/test_group.py::TestGroupRoot::testCopyUsers[None-id-name] PASSED [ 26%]
02:24:16 test/integration/clitest/test_group.py::TestGroupRoot::testCopyUsers[None-name-id] PASSED [ 26%]
02:24:24 test/integration/clitest/test_group.py::TestGroupRoot::testCopyUsers[None-name-name] PASSED [ 26%]
02:24:32 test/integration/clitest/test_group.py::TestGroupRoot::testCopyUsers[--as-owner-id-id] PASSED [ 26%]
02:24:39 test/integration/clitest/test_group.py::TestGroupRoot::testCopyUsers[--as-owner-id-name] PASSED [ 26%]
02:24:47 test/integration/clitest/test_group.py::TestGroupRoot::testCopyUsers[--as-owner-name-id] PASSED [ 26%]
02:24:54 test/integration/clitest/test_group.py::TestGroupRoot::testCopyUsers[--as-owner-name-name] PASSED [ 26%]
02:24:59 test/integration/clitest/test_import.py::TestImport::testAutoClose PASSED [ 26%]
02:25:01 test/integration/clitest/test_import.py::TestImport::testChecksumAlgorithm[Adler-32-legacy] PASSED [ 26%]
02:25:04 test/integration/clitest/test_import.py::TestImport::testChecksumAlgorithm[Adler-32-underscore] PASSED [ 26%]
02:25:06 test/integration/clitest/test_import.py::TestImport::testChecksumAlgorithm[CRC-32-underscore] PASSED [ 26%]
02:25:09 test/integration/clitest/test_import.py::TestImport::testChecksumAlgorithm[File-Size-64-underscore] PASSED [ 26%]
02:25:11 test/integration/clitest/test_import.py::TestImport::testChecksumAlgorithm[MD5-128-underscore] PASSED [ 26%]
02:25:14 test/integration/clitest/test_import.py::TestImport::testChecksumAlgorithm[Murmur3-32-underscore] PASSED [ 26%]
02:25:16 test/integration/clitest/test_import.py::TestImport::testChecksumAlgorithm[Murmur3-128-underscore] PASSED [ 26%]
02:25:19 test/integration/clitest/test_import.py::TestImport::testChecksumAlgorithm[SHA1-160-underscore] PASSED [ 26%]
02:25:21 test/integration/clitest/test_import.py::TestImport::testAnnotationText[Python-1-Official-True] PASSED [ 27%]
02:25:24 test/integration/clitest/test_import.py::TestImport::testAnnotationText[Python-1-Official-False] PASSED [ 27%]
02:25:26 test/integration/clitest/test_import.py::TestImport::testAnnotationText[Python-1-Deprecated-True] PASSED [ 27%]
02:25:29 test/integration/clitest/test_import.py::TestImport::testAnnotationText[Python-1-Deprecated-False] PASSED [ 27%]
02:25:32 test/integration/clitest/test_import.py::TestImport::testAnnotationText[Java-1-Official-True] PASSED [ 27%]
02:25:35 test/integration/clitest/test_import.py::TestImport::testAnnotationText[Java-1-Official-False] PASSED [ 27%]
02:25:37 test/integration/clitest/test_import.py::TestImport::testAnnotationText[Java-1-Deprecated-True] PASSED [ 27%]
02:25:40 test/integration/clitest/test_import.py::TestImport::testAnnotationText[Java-1-Deprecated-False] PASSED [ 27%]
02:25:42 test/integration/clitest/test_import.py::TestImport::testAnnotationText[Java-2-Official-True] PASSED [ 27%]
02:25:45 test/integration/clitest/test_import.py::TestImport::testAnnotationText[Java-2-Official-False] PASSED [ 27%]
02:25:47 test/integration/clitest/test_import.py::TestImport::testAnnotationText[Java-2-Deprecated-True] PASSED [ 27%]
02:25:49 test/integration/clitest/test_import.py::TestImport::testAnnotationText[Java-2-Deprecated-False] PASSED [ 27%]
02:25:52 test/integration/clitest/test_import.py::TestImport::testAnnotationText_one_ns[Python-1-Official] PASSED [ 27%]
02:25:55 test/integration/clitest/test_import.py::TestImport::testAnnotationText_one_ns[Python-1-Deprecated] PASSED [ 27%]
02:25:57 test/integration/clitest/test_import.py::TestImport::testAnnotationText_one_ns[Java-1-Official] PASSED [ 27%]
02:26:00 test/integration/clitest/test_import.py::TestImport::testAnnotationText_one_ns[Java-1-Deprecated] PASSED [ 27%]
02:26:02 test/integration/clitest/test_import.py::TestImport::testAnnotationText_one_ns[Java-2-Official] PASSED [ 27%]
02:26:05 test/integration/clitest/test_import.py::TestImport::testAnnotationText_one_ns[Java-2-Deprecated] PASSED [ 27%]
02:26:07 test/integration/clitest/test_import.py::TestImport::testAnnotationLink[Python-1-Official] PASSED [ 27%]
02:26:10 test/integration/clitest/test_import.py::TestImport::testAnnotationLink[Python-1-Deprecated] PASSED [ 27%]
02:26:12 test/integration/clitest/test_import.py::TestImport::testAnnotationLink[Java-1-Official] PASSED [ 28%]
02:26:15 test/integration/clitest/test_import.py::TestImport::testAnnotationLink[Java-1-Deprecated] PASSED [ 28%]
02:26:17 test/integration/clitest/test_import.py::TestImport::testAnnotationLink[Java-2-Official] PASSED [ 28%]
02:26:20 test/integration/clitest/test_import.py::TestImport::testAnnotationLink[Java-2-Deprecated] PASSED [ 28%]
02:26:27 test/integration/clitest/test_import.py::TestImport::testTargetArgument[source0-True] PASSED [ 28%]
02:26:32 test/integration/clitest/test_import.py::TestImport::testTargetArgument[source0-False] PASSED [ 28%]
02:26:39 test/integration/clitest/test_import.py::TestImport::testTargetArgument[source1-True] PASSED [ 28%]
02:26:44 test/integration/clitest/test_import.py::TestImport::testTargetArgument[source1-False] PASSED [ 28%]
02:26:51 test/integration/clitest/test_import.py::TestImport::testTargetArgument[source2-True] PASSED [ 28%]
02:26:56 test/integration/clitest/test_import.py::TestImport::testTargetArgument[source2-False] PASSED [ 28%]
02:27:03 test/integration/clitest/test_import.py::TestImport::testTargetArgument[source3-True] PASSED [ 28%]
02:27:08 test/integration/clitest/test_import.py::TestImport::testTargetArgument[source3-False] PASSED [ 28%]
02:27:15 test/integration/clitest/test_import.py::TestImport::testTargetArgument[source4-True] PASSED [ 28%]
02:27:20 test/integration/clitest/test_import.py::TestImport::testTargetArgument[source4-False] PASSED [ 28%]
02:27:26 test/integration/clitest/test_import.py::TestImport::testTargetArgument[source5-True] PASSED [ 28%]
02:27:32 test/integration/clitest/test_import.py::TestImport::testTargetArgument[source5-False] PASSED [ 28%]
02:27:39 test/integration/clitest/test_import.py::TestImport::testQualifiedNameModelTargetArgument[-True] PASSED [ 28%]
02:27:44 test/integration/clitest/test_import.py::TestImport::testQualifiedNameModelTargetArgument[-False] PASSED [ 28%]
02:27:51 test/integration/clitest/test_import.py::TestImport::testQualifiedNameModelTargetArgument[+-True] PASSED [ 28%]
02:27:56 test/integration/clitest/test_import.py::TestImport::testQualifiedNameModelTargetArgument[+-False] PASSED [ 28%]
02:28:02 test/integration/clitest/test_import.py::TestImport::testQualifiedNameModelTargetArgument[--True] PASSED [ 28%]
02:28:07 test/integration/clitest/test_import.py::TestImport::testQualifiedNameModelTargetArgument[--False] PASSED [ 29%]
02:28:13 test/integration/clitest/test_import.py::TestImport::testQualifiedNameModelTargetArgument[%-True] PASSED [ 29%]
02:28:18 test/integration/clitest/test_import.py::TestImport::testQualifiedNameModelTargetArgument[%-False] PASSED [ 29%]
02:28:25 test/integration/clitest/test_import.py::TestImport::testQualifiedNameModelTargetArgument[@-True] PASSED [ 29%]
02:28:30 test/integration/clitest/test_import.py::TestImport::testQualifiedNameModelTargetArgument[@-False] PASSED [ 29%]
02:28:36 test/integration/clitest/test_import.py::TestImport::testQualifiedNameTemplateTargetArgument[-True] PASSED [ 29%]
02:28:41 test/integration/clitest/test_import.py::TestImport::testQualifiedNameTemplateTargetArgument[-False] PASSED [ 29%]
02:28:47 test/integration/clitest/test_import.py::TestImport::testQualifiedNameTemplateTargetArgument[+-True] PASSED [ 29%]
02:28:52 test/integration/clitest/test_import.py::TestImport::testQualifiedNameTemplateTargetArgument[+-False] PASSED [ 29%]
02:28:58 test/integration/clitest/test_import.py::TestImport::testQualifiedNameTemplateTargetArgument[--True] PASSED [ 29%]
02:29:02 test/integration/clitest/test_import.py::TestImport::testQualifiedNameTemplateTargetArgument[--False] PASSED [ 29%]
02:29:08 test/integration/clitest/test_import.py::TestImport::testQualifiedNameTemplateTargetArgument[%-True] PASSED [ 29%]
02:29:13 test/integration/clitest/test_import.py::TestImport::testQualifiedNameTemplateTargetArgument[%-False] PASSED [ 29%]
02:29:19 test/integration/clitest/test_import.py::TestImport::testQualifiedNameTemplateTargetArgument[@-True] PASSED [ 29%]
02:29:25 test/integration/clitest/test_import.py::TestImport::testQualifiedNameTemplateTargetArgument[@-False] PASSED [ 29%]
02:29:29 test/integration/clitest/test_import.py::TestImport::testMultipleNameModelTargets[-True] PASSED [ 29%]
02:29:32 test/integration/clitest/test_import.py::TestImport::testMultipleNameModelTargets[-False] PASSED [ 29%]
02:29:36 test/integration/clitest/test_import.py::TestImport::testMultipleNameModelTargets[+-True] PASSED [ 29%]
02:29:39 test/integration/clitest/test_import.py::TestImport::testMultipleNameModelTargets[+-False] PASSED [ 29%]
02:29:43 test/integration/clitest/test_import.py::TestImport::testMultipleNameModelTargets[--True] PASSED [ 29%]
02:29:46 test/integration/clitest/test_import.py::TestImport::testMultipleNameModelTargets[--False] PASSED [ 30%]
02:29:48 test/integration/clitest/test_import.py::TestImport::testUniqueMultipleNameModelTargets[True] PASSED [ 30%]
02:29:50 test/integration/clitest/test_import.py::TestImport::testUniqueMultipleNameModelTargets[False] PASSED [ 30%]
02:29:54 test/integration/clitest/test_import.py::TestImport::testNestedNameTemplateTargetArgument[True] PASSED [ 30%]
02:29:57 test/integration/clitest/test_import.py::TestImport::testNestedNameTemplateTargetArgument[False] PASSED [ 30%]
02:30:00 test/integration/clitest/test_import.py::TestImport::testMultipleNameTemplateTargetArgument[-True] PASSED [ 30%]
02:30:02 test/integration/clitest/test_import.py::TestImport::testMultipleNameTemplateTargetArgument[-False] PASSED [ 30%]
02:30:05 test/integration/clitest/test_import.py::TestImport::testMultipleNameTemplateTargetArgument[+-True] PASSED [ 30%]
02:30:07 test/integration/clitest/test_import.py::TestImport::testMultipleNameTemplateTargetArgument[+-False] PASSED [ 30%]
02:30:10 test/integration/clitest/test_import.py::TestImport::testMultipleNameTemplateTargetArgument[--True] PASSED [ 30%]
02:30:12 test/integration/clitest/test_import.py::TestImport::testMultipleNameTemplateTargetArgument[--False] PASSED [ 30%]
02:30:15 test/integration/clitest/test_import.py::TestImport::testMultipleNameTemplateTargetArgument[@-True] PASSED [ 30%]
02:30:18 test/integration/clitest/test_import.py::TestImport::testMultipleNameTemplateTargetArgument[@-False] PASSED [ 30%]
02:30:20 test/integration/clitest/test_import.py::TestImport::testUniqueMultipleNameTemplateTargetArgument[True] PASSED [ 30%]
02:30:23 test/integration/clitest/test_import.py::TestImport::testUniqueMultipleNameTemplateTargetArgument[False] PASSED [ 30%]
02:30:29 test/integration/clitest/test_import.py::TestImport::testImportLinkableTarget[False-False] PASSED [ 30%]
02:30:36 test/integration/clitest/test_import.py::TestImport::testImportLinkableTarget[False-True] PASSED [ 30%]
02:30:42 test/integration/clitest/test_import.py::TestImport::testImportLinkableTarget[True-False] PASSED [ 30%]
02:30:49 test/integration/clitest/test_import.py::TestImport::testImportLinkableTarget[True-True] PASSED [ 30%]
02:30:51 test/integration/clitest/test_import.py::TestImport::testBadTargetArgument[Project] PASSED [ 30%]
02:30:53 test/integration/clitest/test_import.py::TestImport::testBadTargetArgument[Plate] PASSED [ 31%]
02:30:55 test/integration/clitest/test_import.py::TestImport::testBadTargetArgument[Image] PASSED [ 31%]
02:30:57 test/integration/clitest/test_import.py::TestImport::testBadModelTargetDiscriminator[Dataset] PASSED [ 31%]
02:30:59 test/integration/clitest/test_import.py::TestImport::testBadModelTargetDiscriminator[Screen] PASSED [ 31%]
02:31:02 test/integration/clitest/test_import.py::TestImport::testDebugArgument[None-ALL] PASSED [ 31%]
02:31:04 test/integration/clitest/test_import.py::TestImport::testDebugArgument[None-TRACE] PASSED [ 31%]
02:31:07 test/integration/clitest/test_import.py::TestImport::testDebugArgument[None-DEBUG] PASSED [ 31%]
02:31:09 test/integration/clitest/test_import.py::TestImport::testDebugArgument[None-INFO] PASSED [ 31%]
02:31:11 test/integration/clitest/test_import.py::TestImport::testDebugArgument[None-WARN] PASSED [ 31%]
02:31:14 test/integration/clitest/test_import.py::TestImport::testDebugArgument[None-ERROR] PASSED [ 31%]
02:31:16 test/integration/clitest/test_import.py::TestImport::testDebugArgument[---ALL] PASSED [ 31%]
02:31:19 test/integration/clitest/test_import.py::TestImport::testDebugArgument[---TRACE] PASSED [ 31%]
02:31:21 test/integration/clitest/test_import.py::TestImport::testDebugArgument[---DEBUG] PASSED [ 31%]
02:31:23 test/integration/clitest/test_import.py::TestImport::testDebugArgument[---INFO] PASSED [ 31%]
02:31:26 test/integration/clitest/test_import.py::TestImport::testDebugArgument[---WARN] PASSED [ 31%]
02:31:28 test/integration/clitest/test_import.py::TestImport::testDebugArgument[---ERROR] PASSED [ 31%]
02:31:30 test/integration/clitest/test_import.py::TestImport::testImportOutputDefault PASSED [ 31%]
02:31:33 test/integration/clitest/test_import.py::TestImport::testImportOutputYaml PASSED [ 31%]
02:31:35 test/integration/clitest/test_import.py::TestImport::testImportOutputLegacy PASSED [ 31%]
02:31:38 test/integration/clitest/test_import.py::TestImport::testImportOutputDefaultWithScreen[1] PASSED [ 31%]
02:31:41 test/integration/clitest/test_import.py::TestImport::testImportOutputDefaultWithScreen[2] PASSED [ 32%]
02:31:44 test/integration/clitest/test_import.py::TestImport::testImportOutputDefaultWithScreen[3] PASSED [ 32%]
02:31:49 test/integration/clitest/test_import.py::TestImport::testImportAsRoot PASSED [ 32%]
02:31:53 test/integration/clitest/test_import.py::TestImport::testImportMultiGroup PASSED [ 32%]
02:31:58 test/integration/clitest/test_import.py::TestImport::testImportAsRootMultiGroup PASSED [ 32%]
02:32:00 test/integration/clitest/test_import.py::TestImport::testNamingArguments[Image] PASSED [ 32%]
02:32:02 test/integration/clitest/test_import.py::TestImport::testNamingArguments[Image-x] PASSED [ 32%]
02:32:05 test/integration/clitest/test_import.py::TestImport::testNamingArguments[Image--description] PASSED [ 32%]
02:32:07 test/integration/clitest/test_import.py::TestImport::testNamingArguments[Image-n] PASSED [ 32%]
02:32:10 test/integration/clitest/test_import.py::TestImport::testNamingArguments[Image-n-x] PASSED [ 32%]
02:32:12 test/integration/clitest/test_import.py::TestImport::testNamingArguments[Image-n--description] PASSED [ 32%]
02:32:15 test/integration/clitest/test_import.py::TestImport::testNamingArguments[Image--name] PASSED [ 32%]
02:32:17 test/integration/clitest/test_import.py::TestImport::testNamingArguments[Image--name-x] PASSED [ 32%]
02:32:19 test/integration/clitest/test_import.py::TestImport::testNamingArguments[Image--name--description] PASSED [ 32%]
02:32:22 test/integration/clitest/test_import.py::TestImport::testNamingArguments[Plate] PASSED [ 32%]
02:32:25 test/integration/clitest/test_import.py::TestImport::testNamingArguments[Plate-x] PASSED [ 32%]
02:32:28 test/integration/clitest/test_import.py::TestImport::testNamingArguments[Plate--description] PASSED [ 32%]
02:32:30 test/integration/clitest/test_import.py::TestImport::testNamingArguments[Plate--plate_description] PASSED [ 32%]
02:32:33 test/integration/clitest/test_import.py::TestImport::testNamingArguments[Plate-n] PASSED [ 32%]
02:32:36 test/integration/clitest/test_import.py::TestImport::testNamingArguments[Plate-n-x] PASSED [ 32%]
02:32:39 test/integration/clitest/test_import.py::TestImport::testNamingArguments[Plate-n--description] PASSED [ 32%]
02:32:41 test/integration/clitest/test_import.py::TestImport::testNamingArguments[Plate-n--plate_description] PASSED [ 33%]
02:32:44 test/integration/clitest/test_import.py::TestImport::testNamingArguments[Plate--name] PASSED [ 33%]
02:32:47 test/integration/clitest/test_import.py::TestImport::testNamingArguments[Plate--name-x] PASSED [ 33%]
02:32:49 test/integration/clitest/test_import.py::TestImport::testNamingArguments[Plate--name--description] PASSED [ 33%]
02:32:52 test/integration/clitest/test_import.py::TestImport::testNamingArguments[Plate--name--plate_description] PASSED [ 33%]
02:32:55 test/integration/clitest/test_import.py::TestImport::testNamingArguments[Plate--plate_name] PASSED [ 33%]
02:32:58 test/integration/clitest/test_import.py::TestImport::testNamingArguments[Plate--plate_name-x] PASSED [ 33%]
02:33:00 test/integration/clitest/test_import.py::TestImport::testNamingArguments[Plate--plate_name--description] PASSED [ 33%]
02:33:03 test/integration/clitest/test_import.py::TestImport::testNamingArguments[Plate--plate_name--plate_description] PASSED [ 33%]
02:33:05 test/integration/clitest/test_import.py::TestImport::testNoThumbnails[--no-thumbnails] PASSED [ 33%]
02:33:07 test/integration/clitest/test_import.py::TestImport::testNoThumbnails[--no_thumbnails] PASSED [ 33%]
02:33:10 test/integration/clitest/test_import.py::TestImport::testSkipArguments[] PASSED [ 33%]
02:33:12 test/integration/clitest/test_import.py::TestImport::testSkipArguments[all] PASSED [ 33%]
02:33:14 test/integration/clitest/test_import.py::TestImport::testSkipArguments[checksum] PASSED [ 33%]
02:33:17 test/integration/clitest/test_import.py::TestImport::testSkipArguments[minmax] PASSED [ 33%]
02:33:19 test/integration/clitest/test_import.py::TestImport::testSkipArguments[thumbnails] PASSED [ 33%]
02:33:22 test/integration/clitest/test_import.py::TestImport::testSkipArguments[upgrade] PASSED [ 33%]
02:33:24 test/integration/clitest/test_import.py::TestImport::testSymlinkImport PASSED [ 33%]
02:33:26 test/integration/clitest/test_import.py::TestImport::testUnknownTarget[Dataset-test.fake--d] PASSED [ 33%]
02:33:29 test/integration/clitest/test_import.py::TestImport::testUnknownTarget[Screen-SPW&plates=1&plateRows=1&plateCols=1&fields=1&plateAcqs=1.fake--r] PASSED [ 33%]
02:33:31 test/integration/clitest/test_import.py::TestImport::testEncryption[] PASSED [ 34%]
02:33:33 test/integration/clitest/test_import.py::TestImport::testEncryption[--encrypted=false] PASSED [ 34%]
02:33:36 test/integration/clitest/test_import.py::TestImport::testEncryption[--encrypted=true] PASSED [ 34%]
02:33:36 test/integration/clitest/test_import.py::TestImport::testBulk PASSED     [ 34%]
18:26:26 Build was aborted
18:26:27 Calling Pipeline was cancelled
18:26:27 Recording test results
18:26:29 ERROR: Step ‘Publish JUnit test result report’ failed: No test report files were found. Configuration error?
18:26:29 Build Aborted. Not looking for any TestNG results.
18:26:29 Finished: ABORTED