Skipping 807 KB..
Full Log at java.base/java.util.concurrent.ScheduledThreadPoolExecutor$ScheduledFutureTask.run(ScheduledThreadPoolExecutor.java:305)
02:12:31 at java.base/java.util.concurrent.ThreadPoolExecutor.runWorker(ThreadPoolExecutor.java:1128)
02:12:31 at java.base/java.util.concurrent.ThreadPoolExecutor$Worker.run(ThreadPoolExecutor.java:628)
02:12:31 at java.base/java.lang.Thread.run(Thread.java:829)
02:12:31 Caused by: Ice.CommunicatorDestroyedException: null
02:12:31 at IceInternal.Instance.proxyFactory(Instance.java:239)
02:12:31 at IceInternal.BasicStream.writeProxy(BasicStream.java:2142)
02:12:31 at omero.api.ServiceInterfacePrxHelper.__write(ServiceInterfacePrxHelper.java:114)
02:12:31 at omero.api.ServiceListHelper.write(ServiceListHelper.java:37)
02:12:31 at omero.api.ServiceFactoryPrxHelper.begin_keepAllAlive(ServiceFactoryPrxHelper.java:5946)
02:12:31 at omero.api.ServiceFactoryPrxHelper.keepAllAlive(ServiceFactoryPrxHelper.java:5846)
02:12:31 at omero.api.ServiceFactoryPrxHelper.keepAllAlive(ServiceFactoryPrxHelper.java:5833)
02:12:31 at ome.formats.OMEROMetadataStoreClient.ping(OMEROMetadataStoreClient.java:838)
02:12:31 ... 7 common frames omitted
02:12:32 2025-03-07 02:12:32,047 ERROR [ o.formats.importer.util.ClientKeepAlive] (5-thread-1) Exception while executing ping(), logging Connector out:
02:12:32 java.lang.RuntimeException: Ice.CommunicatorDestroyedException
02:12:32 at ome.formats.OMEROMetadataStoreClient.ping(OMEROMetadataStoreClient.java:845)
02:12:32 at ome.formats.importer.util.ClientKeepAlive.run(ClientKeepAlive.java:77)
02:12:32 at java.base/java.util.concurrent.Executors$RunnableAdapter.call(Executors.java:515)
02:12:32 at java.base/java.util.concurrent.FutureTask.runAndReset(FutureTask.java:305)
02:12:32 at java.base/java.util.concurrent.ScheduledThreadPoolExecutor$ScheduledFutureTask.run(ScheduledThreadPoolExecutor.java:305)
02:12:32 at java.base/java.util.concurrent.ThreadPoolExecutor.runWorker(ThreadPoolExecutor.java:1128)
02:12:32 at java.base/java.util.concurrent.ThreadPoolExecutor$Worker.run(ThreadPoolExecutor.java:628)
02:12:32 at java.base/java.lang.Thread.run(Thread.java:829)
02:12:32 Caused by: Ice.CommunicatorDestroyedException: null
02:12:32 at IceInternal.Instance.proxyFactory(Instance.java:239)
02:12:32 at IceInternal.BasicStream.writeProxy(BasicStream.java:2142)
02:12:32 at omero.api.ServiceInterfacePrxHelper.__write(ServiceInterfacePrxHelper.java:114)
02:12:32 at omero.api.ServiceListHelper.write(ServiceListHelper.java:37)
02:12:32 at omero.api.ServiceFactoryPrxHelper.begin_keepAllAlive(ServiceFactoryPrxHelper.java:5946)
02:12:32 at omero.api.ServiceFactoryPrxHelper.keepAllAlive(ServiceFactoryPrxHelper.java:5846)
02:12:32 at omero.api.ServiceFactoryPrxHelper.keepAllAlive(ServiceFactoryPrxHelper.java:5833)
02:12:32 at ome.formats.OMEROMetadataStoreClient.ping(OMEROMetadataStoreClient.java:838)
02:12:32 ... 7 common frames omitted
02:12:38 2025-03-07 02:12:38,688 ERROR [ o.formats.importer.util.ClientKeepAlive] (7-thread-1) Exception while executing ping(), logging Connector out:
02:12:38 java.lang.RuntimeException: Ice.CommunicatorDestroyedException
02:12:38 at ome.formats.OMEROMetadataStoreClient.ping(OMEROMetadataStoreClient.java:845)
02:12:38 at ome.formats.importer.util.ClientKeepAlive.run(ClientKeepAlive.java:77)
02:12:38 at java.base/java.util.concurrent.Executors$RunnableAdapter.call(Executors.java:515)
02:12:38 at java.base/java.util.concurrent.FutureTask.runAndReset(FutureTask.java:305)
02:12:38 at java.base/java.util.concurrent.ScheduledThreadPoolExecutor$ScheduledFutureTask.run(ScheduledThreadPoolExecutor.java:305)
02:12:38 at java.base/java.util.concurrent.ThreadPoolExecutor.runWorker(ThreadPoolExecutor.java:1128)
02:12:38 at java.base/java.util.concurrent.ThreadPoolExecutor$Worker.run(ThreadPoolExecutor.java:628)
02:12:38 at java.base/java.lang.Thread.run(Thread.java:829)
02:12:38 Caused by: Ice.CommunicatorDestroyedException: null
02:12:38 at IceInternal.Instance.proxyFactory(Instance.java:239)
02:12:38 at IceInternal.BasicStream.writeProxy(BasicStream.java:2142)
02:12:38 at omero.api.ServiceInterfacePrxHelper.__write(ServiceInterfacePrxHelper.java:114)
02:12:38 at omero.api.ServiceListHelper.write(ServiceListHelper.java:37)
02:12:38 at omero.api.ServiceFactoryPrxHelper.begin_keepAllAlive(ServiceFactoryPrxHelper.java:5946)
02:12:38 at omero.api.ServiceFactoryPrxHelper.keepAllAlive(ServiceFactoryPrxHelper.java:5846)
02:12:38 at omero.api.ServiceFactoryPrxHelper.keepAllAlive(ServiceFactoryPrxHelper.java:5833)
02:12:38 at ome.formats.OMEROMetadataStoreClient.ping(OMEROMetadataStoreClient.java:838)
02:12:38 ... 7 common frames omitted
02:12:39 2025-03-07 02:12:39,634 ERROR [ o.formats.importer.util.ClientKeepAlive] (8-thread-1) Exception while executing ping(), logging Connector out:
02:12:39 java.lang.RuntimeException: Ice.CommunicatorDestroyedException
02:12:39 at ome.formats.OMEROMetadataStoreClient.ping(OMEROMetadataStoreClient.java:845)
02:12:39 at ome.formats.importer.util.ClientKeepAlive.run(ClientKeepAlive.java:77)
02:12:39 at java.base/java.util.concurrent.Executors$RunnableAdapter.call(Executors.java:515)
02:12:39 at java.base/java.util.concurrent.FutureTask.runAndReset(FutureTask.java:305)
02:12:39 at java.base/java.util.concurrent.ScheduledThreadPoolExecutor$ScheduledFutureTask.run(ScheduledThreadPoolExecutor.java:305)
02:12:39 at java.base/java.util.concurrent.ThreadPoolExecutor.runWorker(ThreadPoolExecutor.java:1128)
02:12:39 at java.base/java.util.concurrent.ThreadPoolExecutor$Worker.run(ThreadPoolExecutor.java:628)
02:12:39 at java.base/java.lang.Thread.run(Thread.java:829)
02:12:39 Caused by: Ice.CommunicatorDestroyedException: null
02:12:39 at IceInternal.Instance.proxyFactory(Instance.java:239)
02:12:39 at IceInternal.BasicStream.writeProxy(BasicStream.java:2142)
02:12:39 at omero.api.ServiceInterfacePrxHelper.__write(ServiceInterfacePrxHelper.java:114)
02:12:39 at omero.api.ServiceListHelper.write(ServiceListHelper.java:37)
02:12:39 at omero.api.ServiceFactoryPrxHelper.begin_keepAllAlive(ServiceFactoryPrxHelper.java:5946)
02:12:39 at omero.api.ServiceFactoryPrxHelper.keepAllAlive(ServiceFactoryPrxHelper.java:5846)
02:12:39 at omero.api.ServiceFactoryPrxHelper.keepAllAlive(ServiceFactoryPrxHelper.java:5833)
02:12:39 at ome.formats.OMEROMetadataStoreClient.ping(OMEROMetadataStoreClient.java:838)
02:12:39 ... 7 common frames omitted
02:12:47 2025-03-07 02:12:47,254 ERROR [ o.formats.importer.util.ClientKeepAlive] (0-thread-1) Exception while executing ping(), logging Connector out:
02:12:47 java.lang.RuntimeException: Ice.CommunicatorDestroyedException
02:12:47 at ome.formats.OMEROMetadataStoreClient.ping(OMEROMetadataStoreClient.java:845)
02:12:47 at ome.formats.importer.util.ClientKeepAlive.run(ClientKeepAlive.java:77)
02:12:47 at java.base/java.util.concurrent.Executors$RunnableAdapter.call(Executors.java:515)
02:12:47 at java.base/java.util.concurrent.FutureTask.runAndReset(FutureTask.java:305)
02:12:47 at java.base/java.util.concurrent.ScheduledThreadPoolExecutor$ScheduledFutureTask.run(ScheduledThreadPoolExecutor.java:305)
02:12:47 at java.base/java.util.concurrent.ThreadPoolExecutor.runWorker(ThreadPoolExecutor.java:1128)
02:12:47 at java.base/java.util.concurrent.ThreadPoolExecutor$Worker.run(ThreadPoolExecutor.java:628)
02:12:47 at java.base/java.lang.Thread.run(Thread.java:829)
02:12:47 Caused by: Ice.CommunicatorDestroyedException: null
02:12:47 at IceInternal.Instance.proxyFactory(Instance.java:239)
02:12:47 at IceInternal.BasicStream.writeProxy(BasicStream.java:2142)
02:12:47 at omero.api.ServiceInterfacePrxHelper.__write(ServiceInterfacePrxHelper.java:114)
02:12:47 at omero.api.ServiceListHelper.write(ServiceListHelper.java:37)
02:12:47 at omero.api.ServiceFactoryPrxHelper.begin_keepAllAlive(ServiceFactoryPrxHelper.java:5946)
02:12:47 at omero.api.ServiceFactoryPrxHelper.keepAllAlive(ServiceFactoryPrxHelper.java:5846)
02:12:47 at omero.api.ServiceFactoryPrxHelper.keepAllAlive(ServiceFactoryPrxHelper.java:5833)
02:12:47 at ome.formats.OMEROMetadataStoreClient.ping(OMEROMetadataStoreClient.java:838)
02:12:47 ... 7 common frames omitted
02:12:48 2025-03-07 02:12:48,492 ERROR [ o.formats.importer.util.ClientKeepAlive] (1-thread-1) Exception while executing ping(), logging Connector out:
02:12:48 java.lang.RuntimeException: Ice.CommunicatorDestroyedException
02:12:48 at ome.formats.OMEROMetadataStoreClient.ping(OMEROMetadataStoreClient.java:845)
02:12:48 at ome.formats.importer.util.ClientKeepAlive.run(ClientKeepAlive.java:77)
02:12:48 at java.base/java.util.concurrent.Executors$RunnableAdapter.call(Executors.java:515)
02:12:48 at java.base/java.util.concurrent.FutureTask.runAndReset(FutureTask.java:305)
02:12:48 at java.base/java.util.concurrent.ScheduledThreadPoolExecutor$ScheduledFutureTask.run(ScheduledThreadPoolExecutor.java:305)
02:12:48 at java.base/java.util.concurrent.ThreadPoolExecutor.runWorker(ThreadPoolExecutor.java:1128)
02:12:48 at java.base/java.util.concurrent.ThreadPoolExecutor$Worker.run(ThreadPoolExecutor.java:628)
02:12:48 at java.base/java.lang.Thread.run(Thread.java:829)
02:12:48 Caused by: Ice.CommunicatorDestroyedException: null
02:12:48 at IceInternal.Instance.proxyFactory(Instance.java:239)
02:12:48 at IceInternal.BasicStream.writeProxy(BasicStream.java:2142)
02:12:48 at omero.api.ServiceInterfacePrxHelper.__write(ServiceInterfacePrxHelper.java:114)
02:12:48 at omero.api.ServiceListHelper.write(ServiceListHelper.java:37)
02:12:48 at omero.api.ServiceFactoryPrxHelper.begin_keepAllAlive(ServiceFactoryPrxHelper.java:5946)
02:12:48 at omero.api.ServiceFactoryPrxHelper.keepAllAlive(ServiceFactoryPrxHelper.java:5846)
02:12:48 at omero.api.ServiceFactoryPrxHelper.keepAllAlive(ServiceFactoryPrxHelper.java:5833)
02:12:48 at ome.formats.OMEROMetadataStoreClient.ping(OMEROMetadataStoreClient.java:838)
02:12:48 ... 7 common frames omitted
02:12:54 2025-03-07 02:12:54,825 ERROR [ o.formats.importer.util.ClientKeepAlive] (3-thread-1) Exception while executing ping(), logging Connector out:
02:12:54 java.lang.RuntimeException: Ice.CommunicatorDestroyedException
02:12:54 at ome.formats.OMEROMetadataStoreClient.ping(OMEROMetadataStoreClient.java:845)
02:12:54 at ome.formats.importer.util.ClientKeepAlive.run(ClientKeepAlive.java:77)
02:12:54 at java.base/java.util.concurrent.Executors$RunnableAdapter.call(Executors.java:515)
02:12:54 at java.base/java.util.concurrent.FutureTask.runAndReset(FutureTask.java:305)
02:12:54 at java.base/java.util.concurrent.ScheduledThreadPoolExecutor$ScheduledFutureTask.run(ScheduledThreadPoolExecutor.java:305)
02:12:54 at java.base/java.util.concurrent.ThreadPoolExecutor.runWorker(ThreadPoolExecutor.java:1128)
02:12:54 at java.base/java.util.concurrent.ThreadPoolExecutor$Worker.run(ThreadPoolExecutor.java:628)
02:12:54 at java.base/java.lang.Thread.run(Thread.java:829)
02:12:54 Caused by: Ice.CommunicatorDestroyedException: null
02:12:54 at IceInternal.Instance.proxyFactory(Instance.java:239)
02:12:54 at IceInternal.BasicStream.writeProxy(BasicStream.java:2142)
02:12:54 at omero.api.ServiceInterfacePrxHelper.__write(ServiceInterfacePrxHelper.java:114)
02:12:54 at omero.api.ServiceListHelper.write(ServiceListHelper.java:37)
02:12:54 at omero.api.ServiceFactoryPrxHelper.begin_keepAllAlive(ServiceFactoryPrxHelper.java:5946)
02:12:54 at omero.api.ServiceFactoryPrxHelper.keepAllAlive(ServiceFactoryPrxHelper.java:5846)
02:12:54 at omero.api.ServiceFactoryPrxHelper.keepAllAlive(ServiceFactoryPrxHelper.java:5833)
02:12:54 at ome.formats.OMEROMetadataStoreClient.ping(OMEROMetadataStoreClient.java:838)
02:12:54 ... 7 common frames omitted
02:12:55 2025-03-07 02:12:55,976 ERROR [ o.formats.importer.util.ClientKeepAlive] (4-thread-1) Exception while executing ping(), logging Connector out:
02:12:55 java.lang.RuntimeException: Ice.CommunicatorDestroyedException
02:12:55 at ome.formats.OMEROMetadataStoreClient.ping(OMEROMetadataStoreClient.java:845)
02:12:55 at ome.formats.importer.util.ClientKeepAlive.run(ClientKeepAlive.java:77)
02:12:55 at java.base/java.util.concurrent.Executors$RunnableAdapter.call(Executors.java:515)
02:12:55 at java.base/java.util.concurrent.FutureTask.runAndReset(FutureTask.java:305)
02:12:55 at java.base/java.util.concurrent.ScheduledThreadPoolExecutor$ScheduledFutureTask.run(ScheduledThreadPoolExecutor.java:305)
02:12:55 at java.base/java.util.concurrent.ThreadPoolExecutor.runWorker(ThreadPoolExecutor.java:1128)
02:12:55 at java.base/java.util.concurrent.ThreadPoolExecutor$Worker.run(ThreadPoolExecutor.java:628)
02:12:55 at java.base/java.lang.Thread.run(Thread.java:829)
02:12:55 Caused by: Ice.CommunicatorDestroyedException: null
02:12:55 at IceInternal.Instance.proxyFactory(Instance.java:239)
02:12:55 at IceInternal.BasicStream.writeProxy(BasicStream.java:2142)
02:12:55 at omero.api.ServiceInterfacePrxHelper.__write(ServiceInterfacePrxHelper.java:114)
02:12:55 at omero.api.ServiceListHelper.write(ServiceListHelper.java:37)
02:12:55 at omero.api.ServiceFactoryPrxHelper.begin_keepAllAlive(ServiceFactoryPrxHelper.java:5946)
02:12:55 at omero.api.ServiceFactoryPrxHelper.keepAllAlive(ServiceFactoryPrxHelper.java:5846)
02:12:55 at omero.api.ServiceFactoryPrxHelper.keepAllAlive(ServiceFactoryPrxHelper.java:5833)
02:12:55 at ome.formats.OMEROMetadataStoreClient.ping(OMEROMetadataStoreClient.java:838)
02:12:55 ... 7 common frames omitted
02:13:03 2025-03-07 02:13:03,315 ERROR [ o.formats.importer.util.ClientKeepAlive] (6-thread-1) Exception while executing ping(), logging Connector out:
02:13:03 java.lang.RuntimeException: Ice.CommunicatorDestroyedException
02:13:03 at ome.formats.OMEROMetadataStoreClient.ping(OMEROMetadataStoreClient.java:845)
02:13:03 at ome.formats.importer.util.ClientKeepAlive.run(ClientKeepAlive.java:77)
02:13:03 at java.base/java.util.concurrent.Executors$RunnableAdapter.call(Executors.java:515)
02:13:03 at java.base/java.util.concurrent.FutureTask.runAndReset(FutureTask.java:305)
02:13:03 at java.base/java.util.concurrent.ScheduledThreadPoolExecutor$ScheduledFutureTask.run(ScheduledThreadPoolExecutor.java:305)
02:13:03 at java.base/java.util.concurrent.ThreadPoolExecutor.runWorker(ThreadPoolExecutor.java:1128)
02:13:03 at java.base/java.util.concurrent.ThreadPoolExecutor$Worker.run(ThreadPoolExecutor.java:628)
02:13:03 at java.base/java.lang.Thread.run(Thread.java:829)
02:13:03 Caused by: Ice.CommunicatorDestroyedException: null
02:13:03 at IceInternal.Instance.proxyFactory(Instance.java:239)
02:13:03 at IceInternal.BasicStream.writeProxy(BasicStream.java:2142)
02:13:03 at omero.api.ServiceInterfacePrxHelper.__write(ServiceInterfacePrxHelper.java:114)
02:13:03 at omero.api.ServiceListHelper.write(ServiceListHelper.java:37)
02:13:03 at omero.api.ServiceFactoryPrxHelper.begin_keepAllAlive(ServiceFactoryPrxHelper.java:5946)
02:13:03 at omero.api.ServiceFactoryPrxHelper.keepAllAlive(ServiceFactoryPrxHelper.java:5846)
02:13:03 at omero.api.ServiceFactoryPrxHelper.keepAllAlive(ServiceFactoryPrxHelper.java:5833)
02:13:03 at ome.formats.OMEROMetadataStoreClient.ping(OMEROMetadataStoreClient.java:838)
02:13:03 ... 7 common frames omitted
02:13:04 2025-03-07 02:13:04,164 ERROR [ o.formats.importer.util.ClientKeepAlive] (7-thread-1) Exception while executing ping(), logging Connector out:
02:13:04 java.lang.RuntimeException: Ice.CommunicatorDestroyedException
02:13:04 at ome.formats.OMEROMetadataStoreClient.ping(OMEROMetadataStoreClient.java:845)
02:13:04 at ome.formats.importer.util.ClientKeepAlive.run(ClientKeepAlive.java:77)
02:13:04 at java.base/java.util.concurrent.Executors$RunnableAdapter.call(Executors.java:515)
02:13:04 at java.base/java.util.concurrent.FutureTask.runAndReset(FutureTask.java:305)
02:13:04 at java.base/java.util.concurrent.ScheduledThreadPoolExecutor$ScheduledFutureTask.run(ScheduledThreadPoolExecutor.java:305)
02:13:04 at java.base/java.util.concurrent.ThreadPoolExecutor.runWorker(ThreadPoolExecutor.java:1128)
02:13:04 at java.base/java.util.concurrent.ThreadPoolExecutor$Worker.run(ThreadPoolExecutor.java:628)
02:13:04 at java.base/java.lang.Thread.run(Thread.java:829)
02:13:04 Caused by: Ice.CommunicatorDestroyedException: null
02:13:04 at IceInternal.Instance.proxyFactory(Instance.java:239)
02:13:04 at IceInternal.BasicStream.writeProxy(BasicStream.java:2142)
02:13:04 at omero.api.ServiceInterfacePrxHelper.__write(ServiceInterfacePrxHelper.java:114)
02:13:04 at omero.api.ServiceListHelper.write(ServiceListHelper.java:37)
02:13:04 at omero.api.ServiceFactoryPrxHelper.begin_keepAllAlive(ServiceFactoryPrxHelper.java:5946)
02:13:04 at omero.api.ServiceFactoryPrxHelper.keepAllAlive(ServiceFactoryPrxHelper.java:5846)
02:13:04 at omero.api.ServiceFactoryPrxHelper.keepAllAlive(ServiceFactoryPrxHelper.java:5833)
02:13:04 at ome.formats.OMEROMetadataStoreClient.ping(OMEROMetadataStoreClient.java:838)
02:13:04 ... 7 common frames omitted
02:13:10 2025-03-07 02:13:10,466 ERROR [ o.formats.importer.util.ClientKeepAlive] (9-thread-1) Exception while executing ping(), logging Connector out:
02:13:10 java.lang.RuntimeException: Ice.CommunicatorDestroyedException
02:13:10 at ome.formats.OMEROMetadataStoreClient.ping(OMEROMetadataStoreClient.java:845)
02:13:10 at ome.formats.importer.util.ClientKeepAlive.run(ClientKeepAlive.java:77)
02:13:10 at java.base/java.util.concurrent.Executors$RunnableAdapter.call(Executors.java:515)
02:13:10 at java.base/java.util.concurrent.FutureTask.runAndReset(FutureTask.java:305)
02:13:10 at java.base/java.util.concurrent.ScheduledThreadPoolExecutor$ScheduledFutureTask.run(ScheduledThreadPoolExecutor.java:305)
02:13:10 at java.base/java.util.concurrent.ThreadPoolExecutor.runWorker(ThreadPoolExecutor.java:1128)
02:13:10 at java.base/java.util.concurrent.ThreadPoolExecutor$Worker.run(ThreadPoolExecutor.java:628)
02:13:10 at java.base/java.lang.Thread.run(Thread.java:829)
02:13:10 Caused by: Ice.CommunicatorDestroyedException: null
02:13:10 at IceInternal.Instance.proxyFactory(Instance.java:239)
02:13:10 at IceInternal.BasicStream.writeProxy(BasicStream.java:2142)
02:13:10 at omero.api.ServiceInterfacePrxHelper.__write(ServiceInterfacePrxHelper.java:114)
02:13:10 at omero.api.ServiceListHelper.write(ServiceListHelper.java:37)
02:13:10 at omero.api.ServiceFactoryPrxHelper.begin_keepAllAlive(ServiceFactoryPrxHelper.java:5946)
02:13:10 at omero.api.ServiceFactoryPrxHelper.keepAllAlive(ServiceFactoryPrxHelper.java:5846)
02:13:10 at omero.api.ServiceFactoryPrxHelper.keepAllAlive(ServiceFactoryPrxHelper.java:5833)
02:13:10 at ome.formats.OMEROMetadataStoreClient.ping(OMEROMetadataStoreClient.java:838)
02:13:10 ... 7 common frames omitted
02:13:11 2025-03-07 02:13:11,375 ERROR [ o.formats.importer.util.ClientKeepAlive] (0-thread-1) Exception while executing ping(), logging Connector out:
02:13:11 java.lang.RuntimeException: Ice.CommunicatorDestroyedException
02:13:11 at ome.formats.OMEROMetadataStoreClient.ping(OMEROMetadataStoreClient.java:845)
02:13:11 at ome.formats.importer.util.ClientKeepAlive.run(ClientKeepAlive.java:77)
02:13:11 at java.base/java.util.concurrent.Executors$RunnableAdapter.call(Executors.java:515)
02:13:11 at java.base/java.util.concurrent.FutureTask.runAndReset(FutureTask.java:305)
02:13:11 at java.base/java.util.concurrent.ScheduledThreadPoolExecutor$ScheduledFutureTask.run(ScheduledThreadPoolExecutor.java:305)
02:13:11 at java.base/java.util.concurrent.ThreadPoolExecutor.runWorker(ThreadPoolExecutor.java:1128)
02:13:11 at java.base/java.util.concurrent.ThreadPoolExecutor$Worker.run(ThreadPoolExecutor.java:628)
02:13:11 at java.base/java.lang.Thread.run(Thread.java:829)
02:13:11 Caused by: Ice.CommunicatorDestroyedException: null
02:13:11 at IceInternal.Instance.proxyFactory(Instance.java:239)
02:13:11 at IceInternal.BasicStream.writeProxy(BasicStream.java:2142)
02:13:11 at omero.api.ServiceInterfacePrxHelper.__write(ServiceInterfacePrxHelper.java:114)
02:13:11 at omero.api.ServiceListHelper.write(ServiceListHelper.java:37)
02:13:11 at omero.api.ServiceFactoryPrxHelper.begin_keepAllAlive(ServiceFactoryPrxHelper.java:5946)
02:13:11 at omero.api.ServiceFactoryPrxHelper.keepAllAlive(ServiceFactoryPrxHelper.java:5846)
02:13:11 at omero.api.ServiceFactoryPrxHelper.keepAllAlive(ServiceFactoryPrxHelper.java:5833)
02:13:11 at ome.formats.OMEROMetadataStoreClient.ping(OMEROMetadataStoreClient.java:838)
02:13:11 ... 7 common frames omitted
02:13:14 2025-03-07 02:13:14,951 ERROR [ o.formats.importer.util.ClientKeepAlive] (2-thread-1) Exception while executing ping(), logging Connector out:
02:13:14 java.lang.RuntimeException: Ice.CommunicatorDestroyedException
02:13:14 at ome.formats.OMEROMetadataStoreClient.ping(OMEROMetadataStoreClient.java:845)
02:13:14 at ome.formats.importer.util.ClientKeepAlive.run(ClientKeepAlive.java:77)
02:13:14 at java.base/java.util.concurrent.Executors$RunnableAdapter.call(Executors.java:515)
02:13:14 at java.base/java.util.concurrent.FutureTask.runAndReset(FutureTask.java:305)
02:13:14 at java.base/java.util.concurrent.ScheduledThreadPoolExecutor$ScheduledFutureTask.run(ScheduledThreadPoolExecutor.java:305)
02:13:14 at java.base/java.util.concurrent.ThreadPoolExecutor.runWorker(ThreadPoolExecutor.java:1128)
02:13:14 at java.base/java.util.concurrent.ThreadPoolExecutor$Worker.run(ThreadPoolExecutor.java:628)
02:13:14 at java.base/java.lang.Thread.run(Thread.java:829)
02:13:14 Caused by: Ice.CommunicatorDestroyedException: null
02:13:14 at IceInternal.Instance.proxyFactory(Instance.java:239)
02:13:14 at IceInternal.BasicStream.writeProxy(BasicStream.java:2142)
02:13:14 at omero.api.ServiceInterfacePrxHelper.__write(ServiceInterfacePrxHelper.java:114)
02:13:14 at omero.api.ServiceListHelper.write(ServiceListHelper.java:37)
02:13:14 at omero.api.ServiceFactoryPrxHelper.begin_keepAllAlive(ServiceFactoryPrxHelper.java:5946)
02:13:14 at omero.api.ServiceFactoryPrxHelper.keepAllAlive(ServiceFactoryPrxHelper.java:5846)
02:13:14 at omero.api.ServiceFactoryPrxHelper.keepAllAlive(ServiceFactoryPrxHelper.java:5833)
02:13:14 at ome.formats.OMEROMetadataStoreClient.ping(OMEROMetadataStoreClient.java:838)
02:13:14 ... 7 common frames omitted
02:13:15 2025-03-07 02:13:15,902 ERROR [ o.formats.importer.util.ClientKeepAlive] (3-thread-1) Exception while executing ping(), logging Connector out:
02:13:15 java.lang.RuntimeException: Ice.CommunicatorDestroyedException
02:13:15 at ome.formats.OMEROMetadataStoreClient.ping(OMEROMetadataStoreClient.java:845)
02:13:15 at ome.formats.importer.util.ClientKeepAlive.run(ClientKeepAlive.java:77)
02:13:15 at java.base/java.util.concurrent.Executors$RunnableAdapter.call(Executors.java:515)
02:13:15 at java.base/java.util.concurrent.FutureTask.runAndReset(FutureTask.java:305)
02:13:15 at java.base/java.util.concurrent.ScheduledThreadPoolExecutor$ScheduledFutureTask.run(ScheduledThreadPoolExecutor.java:305)
02:13:15 at java.base/java.util.concurrent.ThreadPoolExecutor.runWorker(ThreadPoolExecutor.java:1128)
02:13:15 at java.base/java.util.concurrent.ThreadPoolExecutor$Worker.run(ThreadPoolExecutor.java:628)
02:13:15 at java.base/java.lang.Thread.run(Thread.java:829)
02:13:15 Caused by: Ice.CommunicatorDestroyedException: null
02:13:15 at IceInternal.Instance.proxyFactory(Instance.java:239)
02:13:15 at IceInternal.BasicStream.writeProxy(BasicStream.java:2142)
02:13:15 at omero.api.ServiceInterfacePrxHelper.__write(ServiceInterfacePrxHelper.java:114)
02:13:15 at omero.api.ServiceListHelper.write(ServiceListHelper.java:37)
02:13:15 at omero.api.ServiceFactoryPrxHelper.begin_keepAllAlive(ServiceFactoryPrxHelper.java:5946)
02:13:15 at omero.api.ServiceFactoryPrxHelper.keepAllAlive(ServiceFactoryPrxHelper.java:5846)
02:13:15 at omero.api.ServiceFactoryPrxHelper.keepAllAlive(ServiceFactoryPrxHelper.java:5833)
02:13:15 at ome.formats.OMEROMetadataStoreClient.ping(OMEROMetadataStoreClient.java:838)
02:13:15 ... 7 common frames omitted
02:13:23 2025-03-07 02:13:23,446 ERROR [ o.formats.importer.util.ClientKeepAlive] (5-thread-1) Exception while executing ping(), logging Connector out:
02:13:23 java.lang.RuntimeException: Ice.CommunicatorDestroyedException
02:13:23 at ome.formats.OMEROMetadataStoreClient.ping(OMEROMetadataStoreClient.java:845)
02:13:23 at ome.formats.importer.util.ClientKeepAlive.run(ClientKeepAlive.java:77)
02:13:23 at java.base/java.util.concurrent.Executors$RunnableAdapter.call(Executors.java:515)
02:13:23 at java.base/java.util.concurrent.FutureTask.runAndReset(FutureTask.java:305)
02:13:23 at java.base/java.util.concurrent.ScheduledThreadPoolExecutor$ScheduledFutureTask.run(ScheduledThreadPoolExecutor.java:305)
02:13:23 at java.base/java.util.concurrent.ThreadPoolExecutor.runWorker(ThreadPoolExecutor.java:1128)
02:13:23 at java.base/java.util.concurrent.ThreadPoolExecutor$Worker.run(ThreadPoolExecutor.java:628)
02:13:23 at java.base/java.lang.Thread.run(Thread.java:829)
02:13:23 Caused by: Ice.CommunicatorDestroyedException: null
02:13:23 at IceInternal.Instance.proxyFactory(Instance.java:239)
02:13:23 at IceInternal.BasicStream.writeProxy(BasicStream.java:2142)
02:13:23 at omero.api.ServiceInterfacePrxHelper.__write(ServiceInterfacePrxHelper.java:114)
02:13:23 at omero.api.ServiceListHelper.write(ServiceListHelper.java:37)
02:13:23 at omero.api.ServiceFactoryPrxHelper.begin_keepAllAlive(ServiceFactoryPrxHelper.java:5946)
02:13:23 at omero.api.ServiceFactoryPrxHelper.keepAllAlive(ServiceFactoryPrxHelper.java:5846)
02:13:23 at omero.api.ServiceFactoryPrxHelper.keepAllAlive(ServiceFactoryPrxHelper.java:5833)
02:13:23 at ome.formats.OMEROMetadataStoreClient.ping(OMEROMetadataStoreClient.java:838)
02:13:23 ... 7 common frames omitted
02:13:24 2025-03-07 02:13:24,323 ERROR [ o.formats.importer.util.ClientKeepAlive] (6-thread-1) Exception while executing ping(), logging Connector out:
02:13:24 java.lang.RuntimeException: Ice.CommunicatorDestroyedException
02:13:24 at ome.formats.OMEROMetadataStoreClient.ping(OMEROMetadataStoreClient.java:845)
02:13:24 at ome.formats.importer.util.ClientKeepAlive.run(ClientKeepAlive.java:77)
02:13:24 at java.base/java.util.concurrent.Executors$RunnableAdapter.call(Executors.java:515)
02:13:24 at java.base/java.util.concurrent.FutureTask.runAndReset(FutureTask.java:305)
02:13:24 at java.base/java.util.concurrent.ScheduledThreadPoolExecutor$ScheduledFutureTask.run(ScheduledThreadPoolExecutor.java:305)
02:13:24 at java.base/java.util.concurrent.ThreadPoolExecutor.runWorker(ThreadPoolExecutor.java:1128)
02:13:24 at java.base/java.util.concurrent.ThreadPoolExecutor$Worker.run(ThreadPoolExecutor.java:628)
02:13:24 at java.base/java.lang.Thread.run(Thread.java:829)
02:13:24 Caused by: Ice.CommunicatorDestroyedException: null
02:13:24 at IceInternal.Instance.proxyFactory(Instance.java:239)
02:13:24 at IceInternal.BasicStream.writeProxy(BasicStream.java:2142)
02:13:24 at omero.api.ServiceInterfacePrxHelper.__write(ServiceInterfacePrxHelper.java:114)
02:13:24 at omero.api.ServiceListHelper.write(ServiceListHelper.java:37)
02:13:24 at omero.api.ServiceFactoryPrxHelper.begin_keepAllAlive(ServiceFactoryPrxHelper.java:5946)
02:13:24 at omero.api.ServiceFactoryPrxHelper.keepAllAlive(ServiceFactoryPrxHelper.java:5846)
02:13:24 at omero.api.ServiceFactoryPrxHelper.keepAllAlive(ServiceFactoryPrxHelper.java:5833)
02:13:24 at ome.formats.OMEROMetadataStoreClient.ping(OMEROMetadataStoreClient.java:838)
02:13:24 ... 7 common frames omitted
02:13:30 2025-03-07 02:13:30,818 ERROR [ o.formats.importer.util.ClientKeepAlive] (8-thread-1) Exception while executing ping(), logging Connector out:
02:13:30 java.lang.RuntimeException: Ice.CommunicatorDestroyedException
02:13:30 at ome.formats.OMEROMetadataStoreClient.ping(OMEROMetadataStoreClient.java:845)
02:13:30 at ome.formats.importer.util.ClientKeepAlive.run(ClientKeepAlive.java:77)
02:13:30 at java.base/java.util.concurrent.Executors$RunnableAdapter.call(Executors.java:515)
02:13:30 at java.base/java.util.concurrent.FutureTask.runAndReset(FutureTask.java:305)
02:13:30 at java.base/java.util.concurrent.ScheduledThreadPoolExecutor$ScheduledFutureTask.run(ScheduledThreadPoolExecutor.java:305)
02:13:30 at java.base/java.util.concurrent.ThreadPoolExecutor.runWorker(ThreadPoolExecutor.java:1128)
02:13:30 at java.base/java.util.concurrent.ThreadPoolExecutor$Worker.run(ThreadPoolExecutor.java:628)
02:13:30 at java.base/java.lang.Thread.run(Thread.java:829)
02:13:30 Caused by: Ice.CommunicatorDestroyedException: null
02:13:30 at IceInternal.Instance.proxyFactory(Instance.java:239)
02:13:30 at IceInternal.BasicStream.writeProxy(BasicStream.java:2142)
02:13:30 at omero.api.ServiceInterfacePrxHelper.__write(ServiceInterfacePrxHelper.java:114)
02:13:30 at omero.api.ServiceListHelper.write(ServiceListHelper.java:37)
02:13:30 at omero.api.ServiceFactoryPrxHelper.begin_keepAllAlive(ServiceFactoryPrxHelper.java:5946)
02:13:30 at omero.api.ServiceFactoryPrxHelper.keepAllAlive(ServiceFactoryPrxHelper.java:5846)
02:13:30 at omero.api.ServiceFactoryPrxHelper.keepAllAlive(ServiceFactoryPrxHelper.java:5833)
02:13:30 at ome.formats.OMEROMetadataStoreClient.ping(OMEROMetadataStoreClient.java:838)
02:13:30 ... 7 common frames omitted
02:13:31 2025-03-07 02:13:31,746 ERROR [ o.formats.importer.util.ClientKeepAlive] (9-thread-1) Exception while executing ping(), logging Connector out:
02:13:31 java.lang.RuntimeException: Ice.CommunicatorDestroyedException
02:13:31 at ome.formats.OMEROMetadataStoreClient.ping(OMEROMetadataStoreClient.java:845)
02:13:31 at ome.formats.importer.util.ClientKeepAlive.run(ClientKeepAlive.java:77)
02:13:31 at java.base/java.util.concurrent.Executors$RunnableAdapter.call(Executors.java:515)
02:13:31 at java.base/java.util.concurrent.FutureTask.runAndReset(FutureTask.java:305)
02:13:31 at java.base/java.util.concurrent.ScheduledThreadPoolExecutor$ScheduledFutureTask.run(ScheduledThreadPoolExecutor.java:305)
02:13:31 at java.base/java.util.concurrent.ThreadPoolExecutor.runWorker(ThreadPoolExecutor.java:1128)
02:13:31 at java.base/java.util.concurrent.ThreadPoolExecutor$Worker.run(ThreadPoolExecutor.java:628)
02:13:31 at java.base/java.lang.Thread.run(Thread.java:829)
02:13:31 Caused by: Ice.CommunicatorDestroyedException: null
02:13:31 at IceInternal.Instance.proxyFactory(Instance.java:239)
02:13:31 at IceInternal.BasicStream.writeProxy(BasicStream.java:2142)
02:13:31 at omero.api.ServiceInterfacePrxHelper.__write(ServiceInterfacePrxHelper.java:114)
02:13:31 at omero.api.ServiceListHelper.write(ServiceListHelper.java:37)
02:13:31 at omero.api.ServiceFactoryPrxHelper.begin_keepAllAlive(ServiceFactoryPrxHelper.java:5946)
02:13:31 at omero.api.ServiceFactoryPrxHelper.keepAllAlive(ServiceFactoryPrxHelper.java:5846)
02:13:31 at omero.api.ServiceFactoryPrxHelper.keepAllAlive(ServiceFactoryPrxHelper.java:5833)
02:13:31 at ome.formats.OMEROMetadataStoreClient.ping(OMEROMetadataStoreClient.java:838)
02:13:31 ... 7 common frames omitted
02:13:40 2025-03-07 02:13:40,307 ERROR [ o.formats.importer.util.ClientKeepAlive] (1-thread-1) Exception while executing ping(), logging Connector out:
02:13:40 java.lang.RuntimeException: Ice.CommunicatorDestroyedException
02:13:40 at ome.formats.OMEROMetadataStoreClient.ping(OMEROMetadataStoreClient.java:845)
02:13:40 at ome.formats.importer.util.ClientKeepAlive.run(ClientKeepAlive.java:77)
02:13:40 at java.base/java.util.concurrent.Executors$RunnableAdapter.call(Executors.java:515)
02:13:40 at java.base/java.util.concurrent.FutureTask.runAndReset(FutureTask.java:305)
02:13:40 at java.base/java.util.concurrent.ScheduledThreadPoolExecutor$ScheduledFutureTask.run(ScheduledThreadPoolExecutor.java:305)
02:13:40 at java.base/java.util.concurrent.ThreadPoolExecutor.runWorker(ThreadPoolExecutor.java:1128)
02:13:40 at java.base/java.util.concurrent.ThreadPoolExecutor$Worker.run(ThreadPoolExecutor.java:628)
02:13:40 at java.base/java.lang.Thread.run(Thread.java:829)
02:13:40 Caused by: Ice.CommunicatorDestroyedException: null
02:13:40 at IceInternal.Instance.proxyFactory(Instance.java:239)
02:13:40 at IceInternal.BasicStream.writeProxy(BasicStream.java:2142)
02:13:40 at omero.api.ServiceInterfacePrxHelper.__write(ServiceInterfacePrxHelper.java:114)
02:13:40 at omero.api.ServiceListHelper.write(ServiceListHelper.java:37)
02:13:40 at omero.api.ServiceFactoryPrxHelper.begin_keepAllAlive(ServiceFactoryPrxHelper.java:5946)
02:13:40 at omero.api.ServiceFactoryPrxHelper.keepAllAlive(ServiceFactoryPrxHelper.java:5846)
02:13:40 at omero.api.ServiceFactoryPrxHelper.keepAllAlive(ServiceFactoryPrxHelper.java:5833)
02:13:40 at ome.formats.OMEROMetadataStoreClient.ping(OMEROMetadataStoreClient.java:838)
02:13:40 ... 7 common frames omitted
02:13:41 2025-03-07 02:13:41,228 ERROR [ o.formats.importer.util.ClientKeepAlive] (2-thread-1) Exception while executing ping(), logging Connector out:
02:13:41 java.lang.RuntimeException: Ice.CommunicatorDestroyedException
02:13:41 at ome.formats.OMEROMetadataStoreClient.ping(OMEROMetadataStoreClient.java:845)
02:13:41 at ome.formats.importer.util.ClientKeepAlive.run(ClientKeepAlive.java:77)
02:13:41 at java.base/java.util.concurrent.Executors$RunnableAdapter.call(Executors.java:515)
02:13:41 at java.base/java.util.concurrent.FutureTask.runAndReset(FutureTask.java:305)
02:13:41 at java.base/java.util.concurrent.ScheduledThreadPoolExecutor$ScheduledFutureTask.run(ScheduledThreadPoolExecutor.java:305)
02:13:41 at java.base/java.util.concurrent.ThreadPoolExecutor.runWorker(ThreadPoolExecutor.java:1128)
02:13:41 at java.base/java.util.concurrent.ThreadPoolExecutor$Worker.run(ThreadPoolExecutor.java:628)
02:13:41 at java.base/java.lang.Thread.run(Thread.java:829)
02:13:41 Caused by: Ice.CommunicatorDestroyedException: null
02:13:41 at IceInternal.Instance.proxyFactory(Instance.java:239)
02:13:41 at IceInternal.BasicStream.writeProxy(BasicStream.java:2142)
02:13:41 at omero.api.ServiceInterfacePrxHelper.__write(ServiceInterfacePrxHelper.java:114)
02:13:41 at omero.api.ServiceListHelper.write(ServiceListHelper.java:37)
02:13:41 at omero.api.ServiceFactoryPrxHelper.begin_keepAllAlive(ServiceFactoryPrxHelper.java:5946)
02:13:41 at omero.api.ServiceFactoryPrxHelper.keepAllAlive(ServiceFactoryPrxHelper.java:5846)
02:13:41 at omero.api.ServiceFactoryPrxHelper.keepAllAlive(ServiceFactoryPrxHelper.java:5833)
02:13:41 at ome.formats.OMEROMetadataStoreClient.ping(OMEROMetadataStoreClient.java:838)
02:13:41 ... 7 common frames omitted
02:13:46 2025-03-07 02:13:46,884 ERROR [ o.formats.importer.util.ClientKeepAlive] (4-thread-1) Exception while executing ping(), logging Connector out:
02:13:46 java.lang.RuntimeException: Ice.CommunicatorDestroyedException
02:13:46 at ome.formats.OMEROMetadataStoreClient.ping(OMEROMetadataStoreClient.java:845)
02:13:46 at ome.formats.importer.util.ClientKeepAlive.run(ClientKeepAlive.java:77)
02:13:46 at java.base/java.util.concurrent.Executors$RunnableAdapter.call(Executors.java:515)
02:13:46 at java.base/java.util.concurrent.FutureTask.runAndReset(FutureTask.java:305)
02:13:46 at java.base/java.util.concurrent.ScheduledThreadPoolExecutor$ScheduledFutureTask.run(ScheduledThreadPoolExecutor.java:305)
02:13:46 at java.base/java.util.concurrent.ThreadPoolExecutor.runWorker(ThreadPoolExecutor.java:1128)
02:13:46 at java.base/java.util.concurrent.ThreadPoolExecutor$Worker.run(ThreadPoolExecutor.java:628)
02:13:46 at java.base/java.lang.Thread.run(Thread.java:829)
02:13:46 Caused by: Ice.CommunicatorDestroyedException: null
02:13:46 at IceInternal.Instance.proxyFactory(Instance.java:239)
02:13:46 at IceInternal.BasicStream.writeProxy(BasicStream.java:2142)
02:13:46 at omero.api.ServiceInterfacePrxHelper.__write(ServiceInterfacePrxHelper.java:114)
02:13:46 at omero.api.ServiceListHelper.write(ServiceListHelper.java:37)
02:13:46 at omero.api.ServiceFactoryPrxHelper.begin_keepAllAlive(ServiceFactoryPrxHelper.java:5946)
02:13:46 at omero.api.ServiceFactoryPrxHelper.keepAllAlive(ServiceFactoryPrxHelper.java:5846)
02:13:46 at omero.api.ServiceFactoryPrxHelper.keepAllAlive(ServiceFactoryPrxHelper.java:5833)
02:13:46 at ome.formats.OMEROMetadataStoreClient.ping(OMEROMetadataStoreClient.java:838)
02:13:46 ... 7 common frames omitted
02:13:47 2025-03-07 02:13:47,758 ERROR [ o.formats.importer.util.ClientKeepAlive] (5-thread-1) Exception while executing ping(), logging Connector out:
02:13:47 java.lang.RuntimeException: Ice.CommunicatorDestroyedException
02:13:47 at ome.formats.OMEROMetadataStoreClient.ping(OMEROMetadataStoreClient.java:845)
02:13:47 at ome.formats.importer.util.ClientKeepAlive.run(ClientKeepAlive.java:77)
02:13:47 at java.base/java.util.concurrent.Executors$RunnableAdapter.call(Executors.java:515)
02:13:47 at java.base/java.util.concurrent.FutureTask.runAndReset(FutureTask.java:305)
02:13:47 at java.base/java.util.concurrent.ScheduledThreadPoolExecutor$ScheduledFutureTask.run(ScheduledThreadPoolExecutor.java:305)
02:13:47 at java.base/java.util.concurrent.ThreadPoolExecutor.runWorker(ThreadPoolExecutor.java:1128)
02:13:47 at java.base/java.util.concurrent.ThreadPoolExecutor$Worker.run(ThreadPoolExecutor.java:628)
02:13:47 at java.base/java.lang.Thread.run(Thread.java:829)
02:13:47 Caused by: Ice.CommunicatorDestroyedException: null
02:13:47 at IceInternal.Instance.proxyFactory(Instance.java:239)
02:13:47 at IceInternal.BasicStream.writeProxy(BasicStream.java:2142)
02:13:47 at omero.api.ServiceInterfacePrxHelper.__write(ServiceInterfacePrxHelper.java:114)
02:13:47 at omero.api.ServiceListHelper.write(ServiceListHelper.java:37)
02:13:47 at omero.api.ServiceFactoryPrxHelper.begin_keepAllAlive(ServiceFactoryPrxHelper.java:5946)
02:13:47 at omero.api.ServiceFactoryPrxHelper.keepAllAlive(ServiceFactoryPrxHelper.java:5846)
02:13:47 at omero.api.ServiceFactoryPrxHelper.keepAllAlive(ServiceFactoryPrxHelper.java:5833)
02:13:47 at ome.formats.OMEROMetadataStoreClient.ping(OMEROMetadataStoreClient.java:838)
02:13:47 ... 7 common frames omitted
02:13:55 2025-03-07 02:13:55,613 ERROR [ o.formats.importer.util.ClientKeepAlive] (7-thread-1) Exception while executing ping(), logging Connector out:
02:13:55 java.lang.RuntimeException: Ice.CommunicatorDestroyedException
02:13:55 at ome.formats.OMEROMetadataStoreClient.ping(OMEROMetadataStoreClient.java:845)
02:13:55 at ome.formats.importer.util.ClientKeepAlive.run(ClientKeepAlive.java:77)
02:13:55 at java.base/java.util.concurrent.Executors$RunnableAdapter.call(Executors.java:515)
02:13:55 at java.base/java.util.concurrent.FutureTask.runAndReset(FutureTask.java:305)
02:13:55 at java.base/java.util.concurrent.ScheduledThreadPoolExecutor$ScheduledFutureTask.run(ScheduledThreadPoolExecutor.java:305)
02:13:55 at java.base/java.util.concurrent.ThreadPoolExecutor.runWorker(ThreadPoolExecutor.java:1128)
02:13:55 at java.base/java.util.concurrent.ThreadPoolExecutor$Worker.run(ThreadPoolExecutor.java:628)
02:13:55 at java.base/java.lang.Thread.run(Thread.java:829)
02:13:55 Caused by: Ice.CommunicatorDestroyedException: null
02:13:55 at IceInternal.Instance.proxyFactory(Instance.java:239)
02:13:55 at IceInternal.BasicStream.writeProxy(BasicStream.java:2142)
02:13:55 at omero.api.ServiceInterfacePrxHelper.__write(ServiceInterfacePrxHelper.java:114)
02:13:55 at omero.api.ServiceListHelper.write(ServiceListHelper.java:37)
02:13:55 at omero.api.ServiceFactoryPrxHelper.begin_keepAllAlive(ServiceFactoryPrxHelper.java:5946)
02:13:55 at omero.api.ServiceFactoryPrxHelper.keepAllAlive(ServiceFactoryPrxHelper.java:5846)
02:13:55 at omero.api.ServiceFactoryPrxHelper.keepAllAlive(ServiceFactoryPrxHelper.java:5833)
02:13:55 at ome.formats.OMEROMetadataStoreClient.ping(OMEROMetadataStoreClient.java:838)
02:13:55 ... 7 common frames omitted
02:13:56 2025-03-07 02:13:56,554 ERROR [ o.formats.importer.util.ClientKeepAlive] (8-thread-1) Exception while executing ping(), logging Connector out:
02:13:56 java.lang.RuntimeException: Ice.CommunicatorDestroyedException
02:13:56 at ome.formats.OMEROMetadataStoreClient.ping(OMEROMetadataStoreClient.java:845)
02:13:56 at ome.formats.importer.util.ClientKeepAlive.run(ClientKeepAlive.java:77)
02:13:56 at java.base/java.util.concurrent.Executors$RunnableAdapter.call(Executors.java:515)
02:13:56 at java.base/java.util.concurrent.FutureTask.runAndReset(FutureTask.java:305)
02:13:56 at java.base/java.util.concurrent.ScheduledThreadPoolExecutor$ScheduledFutureTask.run(ScheduledThreadPoolExecutor.java:305)
02:13:56 at java.base/java.util.concurrent.ThreadPoolExecutor.runWorker(ThreadPoolExecutor.java:1128)
02:13:56 at java.base/java.util.concurrent.ThreadPoolExecutor$Worker.run(ThreadPoolExecutor.java:628)
02:13:56 at java.base/java.lang.Thread.run(Thread.java:829)
02:13:56 Caused by: Ice.CommunicatorDestroyedException: null
02:13:56 at IceInternal.Instance.proxyFactory(Instance.java:239)
02:13:56 at IceInternal.BasicStream.writeProxy(BasicStream.java:2142)
02:13:56 at omero.api.ServiceInterfacePrxHelper.__write(ServiceInterfacePrxHelper.java:114)
02:13:56 at omero.api.ServiceListHelper.write(ServiceListHelper.java:37)
02:13:56 at omero.api.ServiceFactoryPrxHelper.begin_keepAllAlive(ServiceFactoryPrxHelper.java:5946)
02:13:56 at omero.api.ServiceFactoryPrxHelper.keepAllAlive(ServiceFactoryPrxHelper.java:5846)
02:13:56 at omero.api.ServiceFactoryPrxHelper.keepAllAlive(ServiceFactoryPrxHelper.java:5833)
02:13:56 at ome.formats.OMEROMetadataStoreClient.ping(OMEROMetadataStoreClient.java:838)
02:13:56 ... 7 common frames omitted
02:14:03 2025-03-07 02:14:03,419 ERROR [ o.formats.importer.util.ClientKeepAlive] (0-thread-1) Exception while executing ping(), logging Connector out:
02:14:03 java.lang.RuntimeException: Ice.CommunicatorDestroyedException
02:14:03 at ome.formats.OMEROMetadataStoreClient.ping(OMEROMetadataStoreClient.java:845)
02:14:03 at ome.formats.importer.util.ClientKeepAlive.run(ClientKeepAlive.java:77)
02:14:03 at java.base/java.util.concurrent.Executors$RunnableAdapter.call(Executors.java:515)
02:14:03 at java.base/java.util.concurrent.FutureTask.runAndReset(FutureTask.java:305)
02:14:03 at java.base/java.util.concurrent.ScheduledThreadPoolExecutor$ScheduledFutureTask.run(ScheduledThreadPoolExecutor.java:305)
02:14:03 at java.base/java.util.concurrent.ThreadPoolExecutor.runWorker(ThreadPoolExecutor.java:1128)
02:14:03 at java.base/java.util.concurrent.ThreadPoolExecutor$Worker.run(ThreadPoolExecutor.java:628)
02:14:03 at java.base/java.lang.Thread.run(Thread.java:829)
02:14:03 Caused by: Ice.CommunicatorDestroyedException: null
02:14:03 at IceInternal.Instance.proxyFactory(Instance.java:239)
02:14:03 at IceInternal.BasicStream.writeProxy(BasicStream.java:2142)
02:14:03 at omero.api.ServiceInterfacePrxHelper.__write(ServiceInterfacePrxHelper.java:114)
02:14:03 at omero.api.ServiceListHelper.write(ServiceListHelper.java:37)
02:14:03 at omero.api.ServiceFactoryPrxHelper.begin_keepAllAlive(ServiceFactoryPrxHelper.java:5946)
02:14:03 at omero.api.ServiceFactoryPrxHelper.keepAllAlive(ServiceFactoryPrxHelper.java:5846)
02:14:03 at omero.api.ServiceFactoryPrxHelper.keepAllAlive(ServiceFactoryPrxHelper.java:5833)
02:14:03 at ome.formats.OMEROMetadataStoreClient.ping(OMEROMetadataStoreClient.java:838)
02:14:03 ... 7 common frames omitted
02:14:04 2025-03-07 02:14:04,393 ERROR [ o.formats.importer.util.ClientKeepAlive] (1-thread-1) Exception while executing ping(), logging Connector out:
02:14:04 java.lang.RuntimeException: Ice.CommunicatorDestroyedException
02:14:04 at ome.formats.OMEROMetadataStoreClient.ping(OMEROMetadataStoreClient.java:845)
02:14:04 at ome.formats.importer.util.ClientKeepAlive.run(ClientKeepAlive.java:77)
02:14:04 at java.base/java.util.concurrent.Executors$RunnableAdapter.call(Executors.java:515)
02:14:04 at java.base/java.util.concurrent.FutureTask.runAndReset(FutureTask.java:305)
02:14:04 at java.base/java.util.concurrent.ScheduledThreadPoolExecutor$ScheduledFutureTask.run(ScheduledThreadPoolExecutor.java:305)
02:14:04 at java.base/java.util.concurrent.ThreadPoolExecutor.runWorker(ThreadPoolExecutor.java:1128)
02:14:04 at java.base/java.util.concurrent.ThreadPoolExecutor$Worker.run(ThreadPoolExecutor.java:628)
02:14:04 at java.base/java.lang.Thread.run(Thread.java:829)
02:14:04 Caused by: Ice.CommunicatorDestroyedException: null
02:14:04 at IceInternal.Instance.proxyFactory(Instance.java:239)
02:14:04 at IceInternal.BasicStream.writeProxy(BasicStream.java:2142)
02:14:04 at omero.api.ServiceInterfacePrxHelper.__write(ServiceInterfacePrxHelper.java:114)
02:14:04 at omero.api.ServiceListHelper.write(ServiceListHelper.java:37)
02:14:04 at omero.api.ServiceFactoryPrxHelper.begin_keepAllAlive(ServiceFactoryPrxHelper.java:5946)
02:14:04 at omero.api.ServiceFactoryPrxHelper.keepAllAlive(ServiceFactoryPrxHelper.java:5846)
02:14:04 at omero.api.ServiceFactoryPrxHelper.keepAllAlive(ServiceFactoryPrxHelper.java:5833)
02:14:04 at ome.formats.OMEROMetadataStoreClient.ping(OMEROMetadataStoreClient.java:838)
02:14:04 ... 7 common frames omitted
02:14:11 2025-03-07 02:14:11,051 ERROR [ o.formats.importer.util.ClientKeepAlive] (3-thread-1) Exception while executing ping(), logging Connector out:
02:14:11 java.lang.RuntimeException: Ice.CommunicatorDestroyedException
02:14:11 at ome.formats.OMEROMetadataStoreClient.ping(OMEROMetadataStoreClient.java:845)
02:14:11 at ome.formats.importer.util.ClientKeepAlive.run(ClientKeepAlive.java:77)
02:14:11 at java.base/java.util.concurrent.Executors$RunnableAdapter.call(Executors.java:515)
02:14:11 at java.base/java.util.concurrent.FutureTask.runAndReset(FutureTask.java:305)
02:14:11 at java.base/java.util.concurrent.ScheduledThreadPoolExecutor$ScheduledFutureTask.run(ScheduledThreadPoolExecutor.java:305)
02:14:11 at java.base/java.util.concurrent.ThreadPoolExecutor.runWorker(ThreadPoolExecutor.java:1128)
02:14:11 at java.base/java.util.concurrent.ThreadPoolExecutor$Worker.run(ThreadPoolExecutor.java:628)
02:14:11 at java.base/java.lang.Thread.run(Thread.java:829)
02:14:11 Caused by: Ice.CommunicatorDestroyedException: null
02:14:11 at IceInternal.Instance.proxyFactory(Instance.java:239)
02:14:11 at IceInternal.BasicStream.writeProxy(BasicStream.java:2142)
02:14:11 at omero.api.ServiceInterfacePrxHelper.__write(ServiceInterfacePrxHelper.java:114)
02:14:11 at omero.api.ServiceListHelper.write(ServiceListHelper.java:37)
02:14:11 at omero.api.ServiceFactoryPrxHelper.begin_keepAllAlive(ServiceFactoryPrxHelper.java:5946)
02:14:11 at omero.api.ServiceFactoryPrxHelper.keepAllAlive(ServiceFactoryPrxHelper.java:5846)
02:14:11 at omero.api.ServiceFactoryPrxHelper.keepAllAlive(ServiceFactoryPrxHelper.java:5833)
02:14:11 at ome.formats.OMEROMetadataStoreClient.ping(OMEROMetadataStoreClient.java:838)
02:14:11 ... 7 common frames omitted
02:14:11 2025-03-07 02:14:11,998 ERROR [ o.formats.importer.util.ClientKeepAlive] (4-thread-1) Exception while executing ping(), logging Connector out:
02:14:11 java.lang.RuntimeException: Ice.CommunicatorDestroyedException
02:14:11 at ome.formats.OMEROMetadataStoreClient.ping(OMEROMetadataStoreClient.java:845)
02:14:11 at ome.formats.importer.util.ClientKeepAlive.run(ClientKeepAlive.java:77)
02:14:11 at java.base/java.util.concurrent.Executors$RunnableAdapter.call(Executors.java:515)
02:14:11 at java.base/java.util.concurrent.FutureTask.runAndReset(FutureTask.java:305)
02:14:11 at java.base/java.util.concurrent.ScheduledThreadPoolExecutor$ScheduledFutureTask.run(ScheduledThreadPoolExecutor.java:305)
02:14:11 at java.base/java.util.concurrent.ThreadPoolExecutor.runWorker(ThreadPoolExecutor.java:1128)
02:14:11 at java.base/java.util.concurrent.ThreadPoolExecutor$Worker.run(ThreadPoolExecutor.java:628)
02:14:11 at java.base/java.lang.Thread.run(Thread.java:829)
02:14:11 Caused by: Ice.CommunicatorDestroyedException: null
02:14:11 at IceInternal.Instance.proxyFactory(Instance.java:239)
02:14:11 at IceInternal.BasicStream.writeProxy(BasicStream.java:2142)
02:14:11 at omero.api.ServiceInterfacePrxHelper.__write(ServiceInterfacePrxHelper.java:114)
02:14:11 at omero.api.ServiceListHelper.write(ServiceListHelper.java:37)
02:14:11 at omero.api.ServiceFactoryPrxHelper.begin_keepAllAlive(ServiceFactoryPrxHelper.java:5946)
02:14:11 at omero.api.ServiceFactoryPrxHelper.keepAllAlive(ServiceFactoryPrxHelper.java:5846)
02:14:11 at omero.api.ServiceFactoryPrxHelper.keepAllAlive(ServiceFactoryPrxHelper.java:5833)
02:14:11 at ome.formats.OMEROMetadataStoreClient.ping(OMEROMetadataStoreClient.java:838)
02:14:11 ... 7 common frames omitted
02:14:18 2025-03-07 02:14:18,650 ERROR [ o.formats.importer.util.ClientKeepAlive] (6-thread-1) Exception while executing ping(), logging Connector out:
02:14:18 java.lang.RuntimeException: Ice.CommunicatorDestroyedException
02:14:18 at ome.formats.OMEROMetadataStoreClient.ping(OMEROMetadataStoreClient.java:845)
02:14:18 at ome.formats.importer.util.ClientKeepAlive.run(ClientKeepAlive.java:77)
02:14:18 at java.base/java.util.concurrent.Executors$RunnableAdapter.call(Executors.java:515)
02:14:18 at java.base/java.util.concurrent.FutureTask.runAndReset(FutureTask.java:305)
02:14:18 at java.base/java.util.concurrent.ScheduledThreadPoolExecutor$ScheduledFutureTask.run(ScheduledThreadPoolExecutor.java:305)
02:14:18 at java.base/java.util.concurrent.ThreadPoolExecutor.runWorker(ThreadPoolExecutor.java:1128)
02:14:18 at java.base/java.util.concurrent.ThreadPoolExecutor$Worker.run(ThreadPoolExecutor.java:628)
02:14:18 at java.base/java.lang.Thread.run(Thread.java:829)
02:14:18 Caused by: Ice.CommunicatorDestroyedException: null
02:14:18 at IceInternal.Instance.proxyFactory(Instance.java:239)
02:14:18 at IceInternal.BasicStream.writeProxy(BasicStream.java:2142)
02:14:18 at omero.api.ServiceInterfacePrxHelper.__write(ServiceInterfacePrxHelper.java:114)
02:14:18 at omero.api.ServiceListHelper.write(ServiceListHelper.java:37)
02:14:18 at omero.api.ServiceFactoryPrxHelper.begin_keepAllAlive(ServiceFactoryPrxHelper.java:5946)
02:14:18 at omero.api.ServiceFactoryPrxHelper.keepAllAlive(ServiceFactoryPrxHelper.java:5846)
02:14:18 at omero.api.ServiceFactoryPrxHelper.keepAllAlive(ServiceFactoryPrxHelper.java:5833)
02:14:18 at ome.formats.OMEROMetadataStoreClient.ping(OMEROMetadataStoreClient.java:838)
02:14:18 ... 7 common frames omitted
02:14:19 2025-03-07 02:14:19,624 ERROR [ o.formats.importer.util.ClientKeepAlive] (7-thread-1) Exception while executing ping(), logging Connector out:
02:14:19 java.lang.RuntimeException: Ice.CommunicatorDestroyedException
02:14:19 at ome.formats.OMEROMetadataStoreClient.ping(OMEROMetadataStoreClient.java:845)
02:14:19 at ome.formats.importer.util.ClientKeepAlive.run(ClientKeepAlive.java:77)
02:14:19 at java.base/java.util.concurrent.Executors$RunnableAdapter.call(Executors.java:515)
02:14:19 at java.base/java.util.concurrent.FutureTask.runAndReset(FutureTask.java:305)
02:14:19 at java.base/java.util.concurrent.ScheduledThreadPoolExecutor$ScheduledFutureTask.run(ScheduledThreadPoolExecutor.java:305)
02:14:19 at java.base/java.util.concurrent.ThreadPoolExecutor.runWorker(ThreadPoolExecutor.java:1128)
02:14:19 at java.base/java.util.concurrent.ThreadPoolExecutor$Worker.run(ThreadPoolExecutor.java:628)
02:14:19 at java.base/java.lang.Thread.run(Thread.java:829)
02:14:19 Caused by: Ice.CommunicatorDestroyedException: null
02:14:19 at IceInternal.Instance.proxyFactory(Instance.java:239)
02:14:19 at IceInternal.BasicStream.writeProxy(BasicStream.java:2142)
02:14:19 at omero.api.ServiceInterfacePrxHelper.__write(ServiceInterfacePrxHelper.java:114)
02:14:19 at omero.api.ServiceListHelper.write(ServiceListHelper.java:37)
02:14:19 at omero.api.ServiceFactoryPrxHelper.begin_keepAllAlive(ServiceFactoryPrxHelper.java:5946)
02:14:19 at omero.api.ServiceFactoryPrxHelper.keepAllAlive(ServiceFactoryPrxHelper.java:5846)
02:14:19 at omero.api.ServiceFactoryPrxHelper.keepAllAlive(ServiceFactoryPrxHelper.java:5833)
02:14:19 at ome.formats.OMEROMetadataStoreClient.ping(OMEROMetadataStoreClient.java:838)
02:14:19 ... 7 common frames omitted
02:14:27 2025-03-07 02:14:27,422 ERROR [ o.formats.importer.util.ClientKeepAlive] (9-thread-1) Exception while executing ping(), logging Connector out:
02:14:27 java.lang.RuntimeException: Ice.CommunicatorDestroyedException
02:14:27 at ome.formats.OMEROMetadataStoreClient.ping(OMEROMetadataStoreClient.java:845)
02:14:27 at ome.formats.importer.util.ClientKeepAlive.run(ClientKeepAlive.java:77)
02:14:27 at java.base/java.util.concurrent.Executors$RunnableAdapter.call(Executors.java:515)
02:14:27 at java.base/java.util.concurrent.FutureTask.runAndReset(FutureTask.java:305)
02:14:27 at java.base/java.util.concurrent.ScheduledThreadPoolExecutor$ScheduledFutureTask.run(ScheduledThreadPoolExecutor.java:305)
02:14:27 at java.base/java.util.concurrent.ThreadPoolExecutor.runWorker(ThreadPoolExecutor.java:1128)
02:14:27 at java.base/java.util.concurrent.ThreadPoolExecutor$Worker.run(ThreadPoolExecutor.java:628)
02:14:27 at java.base/java.lang.Thread.run(Thread.java:829)
02:14:27 Caused by: Ice.CommunicatorDestroyedException: null
02:14:27 at IceInternal.Instance.proxyFactory(Instance.java:239)
02:14:27 at IceInternal.BasicStream.writeProxy(BasicStream.java:2142)
02:14:27 at omero.api.ServiceInterfacePrxHelper.__write(ServiceInterfacePrxHelper.java:114)
02:14:27 at omero.api.ServiceListHelper.write(ServiceListHelper.java:37)
02:14:27 at omero.api.ServiceFactoryPrxHelper.begin_keepAllAlive(ServiceFactoryPrxHelper.java:5946)
02:14:27 at omero.api.ServiceFactoryPrxHelper.keepAllAlive(ServiceFactoryPrxHelper.java:5846)
02:14:27 at omero.api.ServiceFactoryPrxHelper.keepAllAlive(ServiceFactoryPrxHelper.java:5833)
02:14:27 at ome.formats.OMEROMetadataStoreClient.ping(OMEROMetadataStoreClient.java:838)
02:14:27 ... 7 common frames omitted
02:14:28 2025-03-07 02:14:28,421 ERROR [ o.formats.importer.util.ClientKeepAlive] (0-thread-1) Exception while executing ping(), logging Connector out:
02:14:28 java.lang.RuntimeException: Ice.CommunicatorDestroyedException
02:14:28 at ome.formats.OMEROMetadataStoreClient.ping(OMEROMetadataStoreClient.java:845)
02:14:28 at ome.formats.importer.util.ClientKeepAlive.run(ClientKeepAlive.java:77)
02:14:28 at java.base/java.util.concurrent.Executors$RunnableAdapter.call(Executors.java:515)
02:14:28 at java.base/java.util.concurrent.FutureTask.runAndReset(FutureTask.java:305)
02:14:28 at java.base/java.util.concurrent.ScheduledThreadPoolExecutor$ScheduledFutureTask.run(ScheduledThreadPoolExecutor.java:305)
02:14:28 at java.base/java.util.concurrent.ThreadPoolExecutor.runWorker(ThreadPoolExecutor.java:1128)
02:14:28 at java.base/java.util.concurrent.ThreadPoolExecutor$Worker.run(ThreadPoolExecutor.java:628)
02:14:28 at java.base/java.lang.Thread.run(Thread.java:829)
02:14:28 Caused by: Ice.CommunicatorDestroyedException: null
02:14:28 at IceInternal.Instance.proxyFactory(Instance.java:239)
02:14:28 at IceInternal.BasicStream.writeProxy(BasicStream.java:2142)
02:14:28 at omero.api.ServiceInterfacePrxHelper.__write(ServiceInterfacePrxHelper.java:114)
02:14:28 at omero.api.ServiceListHelper.write(ServiceListHelper.java:37)
02:14:28 at omero.api.ServiceFactoryPrxHelper.begin_keepAllAlive(ServiceFactoryPrxHelper.java:5946)
02:14:28 at omero.api.ServiceFactoryPrxHelper.keepAllAlive(ServiceFactoryPrxHelper.java:5846)
02:14:28 at omero.api.ServiceFactoryPrxHelper.keepAllAlive(ServiceFactoryPrxHelper.java:5833)
02:14:28 at ome.formats.OMEROMetadataStoreClient.ping(OMEROMetadataStoreClient.java:838)
02:14:28 ... 7 common frames omitted
02:14:35 2025-03-07 02:14:35,195 ERROR [ o.formats.importer.util.ClientKeepAlive] (2-thread-1) Exception while executing ping(), logging Connector out:
02:14:35 java.lang.RuntimeException: Ice.CommunicatorDestroyedException
02:14:35 at ome.formats.OMEROMetadataStoreClient.ping(OMEROMetadataStoreClient.java:845)
02:14:35 at ome.formats.importer.util.ClientKeepAlive.run(ClientKeepAlive.java:77)
02:14:35 at java.base/java.util.concurrent.Executors$RunnableAdapter.call(Executors.java:515)
02:14:35 at java.base/java.util.concurrent.FutureTask.runAndReset(FutureTask.java:305)
02:14:35 at java.base/java.util.concurrent.ScheduledThreadPoolExecutor$ScheduledFutureTask.run(ScheduledThreadPoolExecutor.java:305)
02:14:35 at java.base/java.util.concurrent.ThreadPoolExecutor.runWorker(ThreadPoolExecutor.java:1128)
02:14:35 at java.base/java.util.concurrent.ThreadPoolExecutor$Worker.run(ThreadPoolExecutor.java:628)
02:14:35 at java.base/java.lang.Thread.run(Thread.java:829)
02:14:35 Caused by: Ice.CommunicatorDestroyedException: null
02:14:35 at IceInternal.Instance.proxyFactory(Instance.java:239)
02:14:35 at IceInternal.BasicStream.writeProxy(BasicStream.java:2142)
02:14:35 at omero.api.ServiceInterfacePrxHelper.__write(ServiceInterfacePrxHelper.java:114)
02:14:35 at omero.api.ServiceListHelper.write(ServiceListHelper.java:37)
02:14:35 at omero.api.ServiceFactoryPrxHelper.begin_keepAllAlive(ServiceFactoryPrxHelper.java:5946)
02:14:35 at omero.api.ServiceFactoryPrxHelper.keepAllAlive(ServiceFactoryPrxHelper.java:5846)
02:14:35 at omero.api.ServiceFactoryPrxHelper.keepAllAlive(ServiceFactoryPrxHelper.java:5833)
02:14:35 at ome.formats.OMEROMetadataStoreClient.ping(OMEROMetadataStoreClient.java:838)
02:14:35 ... 7 common frames omitted
02:14:36 2025-03-07 02:14:36,141 ERROR [ o.formats.importer.util.ClientKeepAlive] (3-thread-1) Exception while executing ping(), logging Connector out:
02:14:36 java.lang.RuntimeException: Ice.CommunicatorDestroyedException
02:14:36 at ome.formats.OMEROMetadataStoreClient.ping(OMEROMetadataStoreClient.java:845)
02:14:36 at ome.formats.importer.util.ClientKeepAlive.run(ClientKeepAlive.java:77)
02:14:36 at java.base/java.util.concurrent.Executors$RunnableAdapter.call(Executors.java:515)
02:14:36 at java.base/java.util.concurrent.FutureTask.runAndReset(FutureTask.java:305)
02:14:36 at java.base/java.util.concurrent.ScheduledThreadPoolExecutor$ScheduledFutureTask.run(ScheduledThreadPoolExecutor.java:305)
02:14:36 at java.base/java.util.concurrent.ThreadPoolExecutor.runWorker(ThreadPoolExecutor.java:1128)
02:14:36 at java.base/java.util.concurrent.ThreadPoolExecutor$Worker.run(ThreadPoolExecutor.java:628)
02:14:36 at java.base/java.lang.Thread.run(Thread.java:829)
02:14:36 Caused by: Ice.CommunicatorDestroyedException: null
02:14:36 at IceInternal.Instance.proxyFactory(Instance.java:239)
02:14:36 at IceInternal.BasicStream.writeProxy(BasicStream.java:2142)
02:14:36 at omero.api.ServiceInterfacePrxHelper.__write(ServiceInterfacePrxHelper.java:114)
02:14:36 at omero.api.ServiceListHelper.write(ServiceListHelper.java:37)
02:14:36 at omero.api.ServiceFactoryPrxHelper.begin_keepAllAlive(ServiceFactoryPrxHelper.java:5946)
02:14:36 at omero.api.ServiceFactoryPrxHelper.keepAllAlive(ServiceFactoryPrxHelper.java:5846)
02:14:36 at omero.api.ServiceFactoryPrxHelper.keepAllAlive(ServiceFactoryPrxHelper.java:5833)
02:14:36 at ome.formats.OMEROMetadataStoreClient.ping(OMEROMetadataStoreClient.java:838)
02:14:36 ... 7 common frames omitted
02:14:42 2025-03-07 02:14:42,694 ERROR [ o.formats.importer.util.ClientKeepAlive] (5-thread-1) Exception while executing ping(), logging Connector out:
02:14:42 java.lang.RuntimeException: Ice.CommunicatorDestroyedException
02:14:42 at ome.formats.OMEROMetadataStoreClient.ping(OMEROMetadataStoreClient.java:845)
02:14:42 at ome.formats.importer.util.ClientKeepAlive.run(ClientKeepAlive.java:77)
02:14:42 at java.base/java.util.concurrent.Executors$RunnableAdapter.call(Executors.java:515)
02:14:42 at java.base/java.util.concurrent.FutureTask.runAndReset(FutureTask.java:305)
02:14:42 at java.base/java.util.concurrent.ScheduledThreadPoolExecutor$ScheduledFutureTask.run(ScheduledThreadPoolExecutor.java:305)
02:14:42 at java.base/java.util.concurrent.ThreadPoolExecutor.runWorker(ThreadPoolExecutor.java:1128)
02:14:42 at java.base/java.util.concurrent.ThreadPoolExecutor$Worker.run(ThreadPoolExecutor.java:628)
02:14:42 at java.base/java.lang.Thread.run(Thread.java:829)
02:14:42 Caused by: Ice.CommunicatorDestroyedException: null
02:14:42 at IceInternal.Instance.proxyFactory(Instance.java:239)
02:14:42 at IceInternal.BasicStream.writeProxy(BasicStream.java:2142)
02:14:42 at omero.api.ServiceInterfacePrxHelper.__write(ServiceInterfacePrxHelper.java:114)
02:14:42 at omero.api.ServiceListHelper.write(ServiceListHelper.java:37)
02:14:42 at omero.api.ServiceFactoryPrxHelper.begin_keepAllAlive(ServiceFactoryPrxHelper.java:5946)
02:14:42 at omero.api.ServiceFactoryPrxHelper.keepAllAlive(ServiceFactoryPrxHelper.java:5846)
02:14:42 at omero.api.ServiceFactoryPrxHelper.keepAllAlive(ServiceFactoryPrxHelper.java:5833)
02:14:42 at ome.formats.OMEROMetadataStoreClient.ping(OMEROMetadataStoreClient.java:838)
02:14:42 ... 7 common frames omitted
02:14:43 2025-03-07 02:14:43,606 ERROR [ o.formats.importer.util.ClientKeepAlive] (6-thread-1) Exception while executing ping(), logging Connector out:
02:14:43 java.lang.RuntimeException: Ice.CommunicatorDestroyedException
02:14:43 at ome.formats.OMEROMetadataStoreClient.ping(OMEROMetadataStoreClient.java:845)
02:14:43 at ome.formats.importer.util.ClientKeepAlive.run(ClientKeepAlive.java:77)
02:14:43 at java.base/java.util.concurrent.Executors$RunnableAdapter.call(Executors.java:515)
02:14:43 at java.base/java.util.concurrent.FutureTask.runAndReset(FutureTask.java:305)
02:14:43 at java.base/java.util.concurrent.ScheduledThreadPoolExecutor$ScheduledFutureTask.run(ScheduledThreadPoolExecutor.java:305)
02:14:43 at java.base/java.util.concurrent.ThreadPoolExecutor.runWorker(ThreadPoolExecutor.java:1128)
02:14:43 at java.base/java.util.concurrent.ThreadPoolExecutor$Worker.run(ThreadPoolExecutor.java:628)
02:14:43 at java.base/java.lang.Thread.run(Thread.java:829)
02:14:43 Caused by: Ice.CommunicatorDestroyedException: null
02:14:43 at IceInternal.Instance.proxyFactory(Instance.java:239)
02:14:43 at IceInternal.BasicStream.writeProxy(BasicStream.java:2142)
02:14:43 at omero.api.ServiceInterfacePrxHelper.__write(ServiceInterfacePrxHelper.java:114)
02:14:43 at omero.api.ServiceListHelper.write(ServiceListHelper.java:37)
02:14:43 at omero.api.ServiceFactoryPrxHelper.begin_keepAllAlive(ServiceFactoryPrxHelper.java:5946)
02:14:43 at omero.api.ServiceFactoryPrxHelper.keepAllAlive(ServiceFactoryPrxHelper.java:5846)
02:14:43 at omero.api.ServiceFactoryPrxHelper.keepAllAlive(ServiceFactoryPrxHelper.java:5833)
02:14:43 at ome.formats.OMEROMetadataStoreClient.ping(OMEROMetadataStoreClient.java:838)
02:14:43 ... 7 common frames omitted
02:14:51 2025-03-07 02:14:51,577 ERROR [ o.formats.importer.util.ClientKeepAlive] (8-thread-1) Exception while executing ping(), logging Connector out:
02:14:51 java.lang.RuntimeException: Ice.CommunicatorDestroyedException
02:14:51 at ome.formats.OMEROMetadataStoreClient.ping(OMEROMetadataStoreClient.java:845)
02:14:51 at ome.formats.importer.util.ClientKeepAlive.run(ClientKeepAlive.java:77)
02:14:51 at java.base/java.util.concurrent.Executors$RunnableAdapter.call(Executors.java:515)
02:14:51 at java.base/java.util.concurrent.FutureTask.runAndReset(FutureTask.java:305)
02:14:51 at java.base/java.util.concurrent.ScheduledThreadPoolExecutor$ScheduledFutureTask.run(ScheduledThreadPoolExecutor.java:305)
02:14:51 at java.base/java.util.concurrent.ThreadPoolExecutor.runWorker(ThreadPoolExecutor.java:1128)
02:14:51 at java.base/java.util.concurrent.ThreadPoolExecutor$Worker.run(ThreadPoolExecutor.java:628)
02:14:51 at java.base/java.lang.Thread.run(Thread.java:829)
02:14:51 Caused by: Ice.CommunicatorDestroyedException: null
02:14:51 at IceInternal.Instance.proxyFactory(Instance.java:239)
02:14:51 at IceInternal.BasicStream.writeProxy(BasicStream.java:2142)
02:14:51 at omero.api.ServiceInterfacePrxHelper.__write(ServiceInterfacePrxHelper.java:114)
02:14:51 at omero.api.ServiceListHelper.write(ServiceListHelper.java:37)
02:14:51 at omero.api.ServiceFactoryPrxHelper.begin_keepAllAlive(ServiceFactoryPrxHelper.java:5946)
02:14:51 at omero.api.ServiceFactoryPrxHelper.keepAllAlive(ServiceFactoryPrxHelper.java:5846)
02:14:51 at omero.api.ServiceFactoryPrxHelper.keepAllAlive(ServiceFactoryPrxHelper.java:5833)
02:14:51 at ome.formats.OMEROMetadataStoreClient.ping(OMEROMetadataStoreClient.java:838)
02:14:51 ... 7 common frames omitted
02:14:52 2025-03-07 02:14:52,444 ERROR [ o.formats.importer.util.ClientKeepAlive] (9-thread-1) Exception while executing ping(), logging Connector out:
02:14:52 java.lang.RuntimeException: Ice.CommunicatorDestroyedException
02:14:52 at ome.formats.OMEROMetadataStoreClient.ping(OMEROMetadataStoreClient.java:845)
02:14:52 at ome.formats.importer.util.ClientKeepAlive.run(ClientKeepAlive.java:77)
02:14:52 at java.base/java.util.concurrent.Executors$RunnableAdapter.call(Executors.java:515)
02:14:52 at java.base/java.util.concurrent.FutureTask.runAndReset(FutureTask.java:305)
02:14:52 at java.base/java.util.concurrent.ScheduledThreadPoolExecutor$ScheduledFutureTask.run(ScheduledThreadPoolExecutor.java:305)
02:14:52 at java.base/java.util.concurrent.ThreadPoolExecutor.runWorker(ThreadPoolExecutor.java:1128)
02:14:52 at java.base/java.util.concurrent.ThreadPoolExecutor$Worker.run(ThreadPoolExecutor.java:628)
02:14:52 at java.base/java.lang.Thread.run(Thread.java:829)
02:14:52 Caused by: Ice.CommunicatorDestroyedException: null
02:14:52 at IceInternal.Instance.proxyFactory(Instance.java:239)
02:14:52 at IceInternal.BasicStream.writeProxy(BasicStream.java:2142)
02:14:52 at omero.api.ServiceInterfacePrxHelper.__write(ServiceInterfacePrxHelper.java:114)
02:14:52 at omero.api.ServiceListHelper.write(ServiceListHelper.java:37)
02:14:52 at omero.api.ServiceFactoryPrxHelper.begin_keepAllAlive(ServiceFactoryPrxHelper.java:5946)
02:14:52 at omero.api.ServiceFactoryPrxHelper.keepAllAlive(ServiceFactoryPrxHelper.java:5846)
02:14:52 at omero.api.ServiceFactoryPrxHelper.keepAllAlive(ServiceFactoryPrxHelper.java:5833)
02:14:52 at ome.formats.OMEROMetadataStoreClient.ping(OMEROMetadataStoreClient.java:838)
02:14:52 ... 7 common frames omitted
02:14:59 2025-03-07 02:14:59,313 ERROR [ o.formats.importer.util.ClientKeepAlive] (1-thread-1) Exception while executing ping(), logging Connector out:
02:14:59 java.lang.RuntimeException: Ice.CommunicatorDestroyedException
02:14:59 at ome.formats.OMEROMetadataStoreClient.ping(OMEROMetadataStoreClient.java:845)
02:14:59 at ome.formats.importer.util.ClientKeepAlive.run(ClientKeepAlive.java:77)
02:14:59 at java.base/java.util.concurrent.Executors$RunnableAdapter.call(Executors.java:515)
02:14:59 at java.base/java.util.concurrent.FutureTask.runAndReset(FutureTask.java:305)
02:14:59 at java.base/java.util.concurrent.ScheduledThreadPoolExecutor$ScheduledFutureTask.run(ScheduledThreadPoolExecutor.java:305)
02:14:59 at java.base/java.util.concurrent.ThreadPoolExecutor.runWorker(ThreadPoolExecutor.java:1128)
02:14:59 at java.base/java.util.concurrent.ThreadPoolExecutor$Worker.run(ThreadPoolExecutor.java:628)
02:14:59 at java.base/java.lang.Thread.run(Thread.java:829)
02:14:59 Caused by: Ice.CommunicatorDestroyedException: null
02:14:59 at IceInternal.Instance.proxyFactory(Instance.java:239)
02:14:59 at IceInternal.BasicStream.writeProxy(BasicStream.java:2142)
02:14:59 at omero.api.ServiceInterfacePrxHelper.__write(ServiceInterfacePrxHelper.java:114)
02:14:59 at omero.api.ServiceListHelper.write(ServiceListHelper.java:37)
02:14:59 at omero.api.ServiceFactoryPrxHelper.begin_keepAllAlive(ServiceFactoryPrxHelper.java:5946)
02:14:59 at omero.api.ServiceFactoryPrxHelper.keepAllAlive(ServiceFactoryPrxHelper.java:5846)
02:14:59 at omero.api.ServiceFactoryPrxHelper.keepAllAlive(ServiceFactoryPrxHelper.java:5833)
02:14:59 at ome.formats.OMEROMetadataStoreClient.ping(OMEROMetadataStoreClient.java:838)
02:14:59 ... 7 common frames omitted
02:15:00 2025-03-07 02:15:00,204 ERROR [ o.formats.importer.util.ClientKeepAlive] (2-thread-1) Exception while executing ping(), logging Connector out:
02:15:00 java.lang.RuntimeException: Ice.CommunicatorDestroyedException
02:15:00 at ome.formats.OMEROMetadataStoreClient.ping(OMEROMetadataStoreClient.java:845)
02:15:00 at ome.formats.importer.util.ClientKeepAlive.run(ClientKeepAlive.java:77)
02:15:00 at java.base/java.util.concurrent.Executors$RunnableAdapter.call(Executors.java:515)
02:15:00 at java.base/java.util.concurrent.FutureTask.runAndReset(FutureTask.java:305)
02:15:00 at java.base/java.util.concurrent.ScheduledThreadPoolExecutor$ScheduledFutureTask.run(ScheduledThreadPoolExecutor.java:305)
02:15:00 at java.base/java.util.concurrent.ThreadPoolExecutor.runWorker(ThreadPoolExecutor.java:1128)
02:15:00 at java.base/java.util.concurrent.ThreadPoolExecutor$Worker.run(ThreadPoolExecutor.java:628)
02:15:00 at java.base/java.lang.Thread.run(Thread.java:829)
02:15:00 Caused by: Ice.CommunicatorDestroyedException: null
02:15:00 at IceInternal.Instance.proxyFactory(Instance.java:239)
02:15:00 at IceInternal.BasicStream.writeProxy(BasicStream.java:2142)
02:15:00 at omero.api.ServiceInterfacePrxHelper.__write(ServiceInterfacePrxHelper.java:114)
02:15:00 at omero.api.ServiceListHelper.write(ServiceListHelper.java:37)
02:15:00 at omero.api.ServiceFactoryPrxHelper.begin_keepAllAlive(ServiceFactoryPrxHelper.java:5946)
02:15:00 at omero.api.ServiceFactoryPrxHelper.keepAllAlive(ServiceFactoryPrxHelper.java:5846)
02:15:00 at omero.api.ServiceFactoryPrxHelper.keepAllAlive(ServiceFactoryPrxHelper.java:5833)
02:15:00 at ome.formats.OMEROMetadataStoreClient.ping(OMEROMetadataStoreClient.java:838)
02:15:00 ... 7 common frames omitted
02:15:07 2025-03-07 02:15:07,051 ERROR [ o.formats.importer.util.ClientKeepAlive] (4-thread-1) Exception while executing ping(), logging Connector out:
02:15:07 java.lang.RuntimeException: Ice.CommunicatorDestroyedException
02:15:07 at ome.formats.OMEROMetadataStoreClient.ping(OMEROMetadataStoreClient.java:845)
02:15:07 at ome.formats.importer.util.ClientKeepAlive.run(ClientKeepAlive.java:77)
02:15:07 at java.base/java.util.concurrent.Executors$RunnableAdapter.call(Executors.java:515)
02:15:07 at java.base/java.util.concurrent.FutureTask.runAndReset(FutureTask.java:305)
02:15:07 at java.base/java.util.concurrent.ScheduledThreadPoolExecutor$ScheduledFutureTask.run(ScheduledThreadPoolExecutor.java:305)
02:15:07 at java.base/java.util.concurrent.ThreadPoolExecutor.runWorker(ThreadPoolExecutor.java:1128)
02:15:07 at java.base/java.util.concurrent.ThreadPoolExecutor$Worker.run(ThreadPoolExecutor.java:628)
02:15:07 at java.base/java.lang.Thread.run(Thread.java:829)
02:15:07 Caused by: Ice.CommunicatorDestroyedException: null
02:15:07 at IceInternal.Instance.proxyFactory(Instance.java:239)
02:15:07 at IceInternal.BasicStream.writeProxy(BasicStream.java:2142)
02:15:07 at omero.api.ServiceInterfacePrxHelper.__write(ServiceInterfacePrxHelper.java:114)
02:15:07 at omero.api.ServiceListHelper.write(ServiceListHelper.java:37)
02:15:07 at omero.api.ServiceFactoryPrxHelper.begin_keepAllAlive(ServiceFactoryPrxHelper.java:5946)
02:15:07 at omero.api.ServiceFactoryPrxHelper.keepAllAlive(ServiceFactoryPrxHelper.java:5846)
02:15:07 at omero.api.ServiceFactoryPrxHelper.keepAllAlive(ServiceFactoryPrxHelper.java:5833)
02:15:07 at ome.formats.OMEROMetadataStoreClient.ping(OMEROMetadataStoreClient.java:838)
02:15:07 ... 7 common frames omitted
02:15:07 2025-03-07 02:15:07,923 ERROR [ o.formats.importer.util.ClientKeepAlive] (5-thread-1) Exception while executing ping(), logging Connector out:
02:15:07 java.lang.RuntimeException: Ice.CommunicatorDestroyedException
02:15:07 at ome.formats.OMEROMetadataStoreClient.ping(OMEROMetadataStoreClient.java:845)
02:15:07 at ome.formats.importer.util.ClientKeepAlive.run(ClientKeepAlive.java:77)
02:15:07 at java.base/java.util.concurrent.Executors$RunnableAdapter.call(Executors.java:515)
02:15:07 at java.base/java.util.concurrent.FutureTask.runAndReset(FutureTask.java:305)
02:15:07 at java.base/java.util.concurrent.ScheduledThreadPoolExecutor$ScheduledFutureTask.run(ScheduledThreadPoolExecutor.java:305)
02:15:07 at java.base/java.util.concurrent.ThreadPoolExecutor.runWorker(ThreadPoolExecutor.java:1128)
02:15:07 at java.base/java.util.concurrent.ThreadPoolExecutor$Worker.run(ThreadPoolExecutor.java:628)
02:15:07 at java.base/java.lang.Thread.run(Thread.java:829)
02:15:07 Caused by: Ice.CommunicatorDestroyedException: null
02:15:07 at IceInternal.Instance.proxyFactory(Instance.java:239)
02:15:07 at IceInternal.BasicStream.writeProxy(BasicStream.java:2142)
02:15:07 at omero.api.ServiceInterfacePrxHelper.__write(ServiceInterfacePrxHelper.java:114)
02:15:07 at omero.api.ServiceListHelper.write(ServiceListHelper.java:37)
02:15:07 at omero.api.ServiceFactoryPrxHelper.begin_keepAllAlive(ServiceFactoryPrxHelper.java:5946)
02:15:07 at omero.api.ServiceFactoryPrxHelper.keepAllAlive(ServiceFactoryPrxHelper.java:5846)
02:15:07 at omero.api.ServiceFactoryPrxHelper.keepAllAlive(ServiceFactoryPrxHelper.java:5833)
02:15:07 at ome.formats.OMEROMetadataStoreClient.ping(OMEROMetadataStoreClient.java:838)
02:15:07 ... 7 common frames omitted
02:15:15 2025-03-07 02:15:15,652 ERROR [ o.formats.importer.util.ClientKeepAlive] (7-thread-1) Exception while executing ping(), logging Connector out:
02:15:15 java.lang.RuntimeException: Ice.CommunicatorDestroyedException
02:15:15 at ome.formats.OMEROMetadataStoreClient.ping(OMEROMetadataStoreClient.java:845)
02:15:15 at ome.formats.importer.util.ClientKeepAlive.run(ClientKeepAlive.java:77)
02:15:15 at java.base/java.util.concurrent.Executors$RunnableAdapter.call(Executors.java:515)
02:15:15 at java.base/java.util.concurrent.FutureTask.runAndReset(FutureTask.java:305)
02:15:15 at java.base/java.util.concurrent.ScheduledThreadPoolExecutor$ScheduledFutureTask.run(ScheduledThreadPoolExecutor.java:305)
02:15:15 at java.base/java.util.concurrent.ThreadPoolExecutor.runWorker(ThreadPoolExecutor.java:1128)
02:15:15 at java.base/java.util.concurrent.ThreadPoolExecutor$Worker.run(ThreadPoolExecutor.java:628)
02:15:15 at java.base/java.lang.Thread.run(Thread.java:829)
02:15:15 Caused by: Ice.CommunicatorDestroyedException: null
02:15:15 at IceInternal.Instance.proxyFactory(Instance.java:239)
02:15:15 at IceInternal.BasicStream.writeProxy(BasicStream.java:2142)
02:15:15 at omero.api.ServiceInterfacePrxHelper.__write(ServiceInterfacePrxHelper.java:114)
02:15:15 at omero.api.ServiceListHelper.write(ServiceListHelper.java:37)
02:15:15 at omero.api.ServiceFactoryPrxHelper.begin_keepAllAlive(ServiceFactoryPrxHelper.java:5946)
02:15:15 at omero.api.ServiceFactoryPrxHelper.keepAllAlive(ServiceFactoryPrxHelper.java:5846)
02:15:15 at omero.api.ServiceFactoryPrxHelper.keepAllAlive(ServiceFactoryPrxHelper.java:5833)
02:15:15 at ome.formats.OMEROMetadataStoreClient.ping(OMEROMetadataStoreClient.java:838)
02:15:15 ... 7 common frames omitted
02:15:16 2025-03-07 02:15:16,510 ERROR [ o.formats.importer.util.ClientKeepAlive] (8-thread-1) Exception while executing ping(), logging Connector out:
02:15:16 java.lang.RuntimeException: Ice.CommunicatorDestroyedException
02:15:16 at ome.formats.OMEROMetadataStoreClient.ping(OMEROMetadataStoreClient.java:845)
02:15:16 at ome.formats.importer.util.ClientKeepAlive.run(ClientKeepAlive.java:77)
02:15:16 at java.base/java.util.concurrent.Executors$RunnableAdapter.call(Executors.java:515)
02:15:16 at java.base/java.util.concurrent.FutureTask.runAndReset(FutureTask.java:305)
02:15:16 at java.base/java.util.concurrent.ScheduledThreadPoolExecutor$ScheduledFutureTask.run(ScheduledThreadPoolExecutor.java:305)
02:15:16 at java.base/java.util.concurrent.ThreadPoolExecutor.runWorker(ThreadPoolExecutor.java:1128)
02:15:16 at java.base/java.util.concurrent.ThreadPoolExecutor$Worker.run(ThreadPoolExecutor.java:628)
02:15:16 at java.base/java.lang.Thread.run(Thread.java:829)
02:15:16 Caused by: Ice.CommunicatorDestroyedException: null
02:15:16 at IceInternal.Instance.proxyFactory(Instance.java:239)
02:15:16 at IceInternal.BasicStream.writeProxy(BasicStream.java:2142)
02:15:16 at omero.api.ServiceInterfacePrxHelper.__write(ServiceInterfacePrxHelper.java:114)
02:15:16 at omero.api.ServiceListHelper.write(ServiceListHelper.java:37)
02:15:16 at omero.api.ServiceFactoryPrxHelper.begin_keepAllAlive(ServiceFactoryPrxHelper.java:5946)
02:15:16 at omero.api.ServiceFactoryPrxHelper.keepAllAlive(ServiceFactoryPrxHelper.java:5846)
02:15:16 at omero.api.ServiceFactoryPrxHelper.keepAllAlive(ServiceFactoryPrxHelper.java:5833)
02:15:16 at ome.formats.OMEROMetadataStoreClient.ping(OMEROMetadataStoreClient.java:838)
02:15:16 ... 7 common frames omitted
02:15:27 2025-03-07 02:15:27,468 ERROR [ o.formats.importer.util.ClientKeepAlive] (0-thread-1) Exception while executing ping(), logging Connector out:
02:15:27 java.lang.RuntimeException: Ice.CommunicatorDestroyedException
02:15:27 at ome.formats.OMEROMetadataStoreClient.ping(OMEROMetadataStoreClient.java:845)
02:15:27 at ome.formats.importer.util.ClientKeepAlive.run(ClientKeepAlive.java:77)
02:15:27 at java.base/java.util.concurrent.Executors$RunnableAdapter.call(Executors.java:515)
02:15:27 at java.base/java.util.concurrent.FutureTask.runAndReset(FutureTask.java:305)
02:15:27 at java.base/java.util.concurrent.ScheduledThreadPoolExecutor$ScheduledFutureTask.run(ScheduledThreadPoolExecutor.java:305)
02:15:27 at java.base/java.util.concurrent.ThreadPoolExecutor.runWorker(ThreadPoolExecutor.java:1128)
02:15:27 at java.base/java.util.concurrent.ThreadPoolExecutor$Worker.run(ThreadPoolExecutor.java:628)
02:15:27 at java.base/java.lang.Thread.run(Thread.java:829)
02:15:27 Caused by: Ice.CommunicatorDestroyedException: null
02:15:27 at IceInternal.Instance.proxyFactory(Instance.java:239)
02:15:27 at IceInternal.BasicStream.writeProxy(BasicStream.java:2142)
02:15:27 at omero.api.ServiceInterfacePrxHelper.__write(ServiceInterfacePrxHelper.java:114)
02:15:27 at omero.api.ServiceListHelper.write(ServiceListHelper.java:37)
02:15:27 at omero.api.ServiceFactoryPrxHelper.begin_keepAllAlive(ServiceFactoryPrxHelper.java:5946)
02:15:27 at omero.api.ServiceFactoryPrxHelper.keepAllAlive(ServiceFactoryPrxHelper.java:5846)
02:15:27 at omero.api.ServiceFactoryPrxHelper.keepAllAlive(ServiceFactoryPrxHelper.java:5833)
02:15:27 at ome.formats.OMEROMetadataStoreClient.ping(OMEROMetadataStoreClient.java:838)
02:15:27 ... 7 common frames omitted
02:15:28 2025-03-07 02:15:28,292 ERROR [ o.formats.importer.util.ClientKeepAlive] (1-thread-1) Exception while executing ping(), logging Connector out:
02:15:28 java.lang.RuntimeException: Ice.CommunicatorDestroyedException
02:15:28 at ome.formats.OMEROMetadataStoreClient.ping(OMEROMetadataStoreClient.java:845)
02:15:28 at ome.formats.importer.util.ClientKeepAlive.run(ClientKeepAlive.java:77)
02:15:28 at java.base/java.util.concurrent.Executors$RunnableAdapter.call(Executors.java:515)
02:15:28 at java.base/java.util.concurrent.FutureTask.runAndReset(FutureTask.java:305)
02:15:28 at java.base/java.util.concurrent.ScheduledThreadPoolExecutor$ScheduledFutureTask.run(ScheduledThreadPoolExecutor.java:305)
02:15:28 at java.base/java.util.concurrent.ThreadPoolExecutor.runWorker(ThreadPoolExecutor.java:1128)
02:15:28 at java.base/java.util.concurrent.ThreadPoolExecutor$Worker.run(ThreadPoolExecutor.java:628)
02:15:28 at java.base/java.lang.Thread.run(Thread.java:829)
02:15:28 Caused by: Ice.CommunicatorDestroyedException: null
02:15:28 at IceInternal.Instance.proxyFactory(Instance.java:239)
02:15:28 at IceInternal.BasicStream.writeProxy(BasicStream.java:2142)
02:15:28 at omero.api.ServiceInterfacePrxHelper.__write(ServiceInterfacePrxHelper.java:114)
02:15:28 at omero.api.ServiceListHelper.write(ServiceListHelper.java:37)
02:15:28 at omero.api.ServiceFactoryPrxHelper.begin_keepAllAlive(ServiceFactoryPrxHelper.java:5946)
02:15:28 at omero.api.ServiceFactoryPrxHelper.keepAllAlive(ServiceFactoryPrxHelper.java:5846)
02:15:28 at omero.api.ServiceFactoryPrxHelper.keepAllAlive(ServiceFactoryPrxHelper.java:5833)
02:15:28 at ome.formats.OMEROMetadataStoreClient.ping(OMEROMetadataStoreClient.java:838)
02:15:28 ... 7 common frames omitted
02:15:34 2025-03-07 02:15:34,887 ERROR [ o.formats.importer.util.ClientKeepAlive] (3-thread-1) Exception while executing ping(), logging Connector out:
02:15:34 java.lang.RuntimeException: Ice.CommunicatorDestroyedException
02:15:34 at ome.formats.OMEROMetadataStoreClient.ping(OMEROMetadataStoreClient.java:845)
02:15:34 at ome.formats.importer.util.ClientKeepAlive.run(ClientKeepAlive.java:77)
02:15:34 at java.base/java.util.concurrent.Executors$RunnableAdapter.call(Executors.java:515)
02:15:34 at java.base/java.util.concurrent.FutureTask.runAndReset(FutureTask.java:305)
02:15:34 at java.base/java.util.concurrent.ScheduledThreadPoolExecutor$ScheduledFutureTask.run(ScheduledThreadPoolExecutor.java:305)
02:15:34 at java.base/java.util.concurrent.ThreadPoolExecutor.runWorker(ThreadPoolExecutor.java:1128)
02:15:34 at java.base/java.util.concurrent.ThreadPoolExecutor$Worker.run(ThreadPoolExecutor.java:628)
02:15:34 at java.base/java.lang.Thread.run(Thread.java:829)
02:15:34 Caused by: Ice.CommunicatorDestroyedException: null
02:15:34 at IceInternal.Instance.proxyFactory(Instance.java:239)
02:15:34 at IceInternal.BasicStream.writeProxy(BasicStream.java:2142)
02:15:34 at omero.api.ServiceInterfacePrxHelper.__write(ServiceInterfacePrxHelper.java:114)
02:15:34 at omero.api.ServiceListHelper.write(ServiceListHelper.java:37)
02:15:34 at omero.api.ServiceFactoryPrxHelper.begin_keepAllAlive(ServiceFactoryPrxHelper.java:5946)
02:15:34 at omero.api.ServiceFactoryPrxHelper.keepAllAlive(ServiceFactoryPrxHelper.java:5846)
02:15:34 at omero.api.ServiceFactoryPrxHelper.keepAllAlive(ServiceFactoryPrxHelper.java:5833)
02:15:34 at ome.formats.OMEROMetadataStoreClient.ping(OMEROMetadataStoreClient.java:838)
02:15:34 ... 7 common frames omitted
02:15:35 2025-03-07 02:15:35,733 ERROR [ o.formats.importer.util.ClientKeepAlive] (4-thread-1) Exception while executing ping(), logging Connector out:
02:15:35 java.lang.RuntimeException: Ice.CommunicatorDestroyedException
02:15:35 at ome.formats.OMEROMetadataStoreClient.ping(OMEROMetadataStoreClient.java:845)
02:15:35 at ome.formats.importer.util.ClientKeepAlive.run(ClientKeepAlive.java:77)
02:15:35 at java.base/java.util.concurrent.Executors$RunnableAdapter.call(Executors.java:515)
02:15:35 at java.base/java.util.concurrent.FutureTask.runAndReset(FutureTask.java:305)
02:15:35 at java.base/java.util.concurrent.ScheduledThreadPoolExecutor$ScheduledFutureTask.run(ScheduledThreadPoolExecutor.java:305)
02:15:35 at java.base/java.util.concurrent.ThreadPoolExecutor.runWorker(ThreadPoolExecutor.java:1128)
02:15:35 at java.base/java.util.concurrent.ThreadPoolExecutor$Worker.run(ThreadPoolExecutor.java:628)
02:15:35 at java.base/java.lang.Thread.run(Thread.java:829)
02:15:35 Caused by: Ice.CommunicatorDestroyedException: null
02:15:35 at IceInternal.Instance.proxyFactory(Instance.java:239)
02:15:35 at IceInternal.BasicStream.writeProxy(BasicStream.java:2142)
02:15:35 at omero.api.ServiceInterfacePrxHelper.__write(ServiceInterfacePrxHelper.java:114)
02:15:35 at omero.api.ServiceListHelper.write(ServiceListHelper.java:37)
02:15:35 at omero.api.ServiceFactoryPrxHelper.begin_keepAllAlive(ServiceFactoryPrxHelper.java:5946)
02:15:35 at omero.api.ServiceFactoryPrxHelper.keepAllAlive(ServiceFactoryPrxHelper.java:5846)
02:15:35 at omero.api.ServiceFactoryPrxHelper.keepAllAlive(ServiceFactoryPrxHelper.java:5833)
02:15:35 at ome.formats.OMEROMetadataStoreClient.ping(OMEROMetadataStoreClient.java:838)
02:15:35 ... 7 common frames omitted
02:15:43 2025-03-07 02:15:43,389 ERROR [ o.formats.importer.util.ClientKeepAlive] (6-thread-1) Exception while executing ping(), logging Connector out:
02:15:43 java.lang.RuntimeException: Ice.CommunicatorDestroyedException
02:15:43 at ome.formats.OMEROMetadataStoreClient.ping(OMEROMetadataStoreClient.java:845)
02:15:43 at ome.formats.importer.util.ClientKeepAlive.run(ClientKeepAlive.java:77)
02:15:43 at java.base/java.util.concurrent.Executors$RunnableAdapter.call(Executors.java:515)
02:15:43 at java.base/java.util.concurrent.FutureTask.runAndReset(FutureTask.java:305)
02:15:43 at java.base/java.util.concurrent.ScheduledThreadPoolExecutor$ScheduledFutureTask.run(ScheduledThreadPoolExecutor.java:305)
02:15:43 at java.base/java.util.concurrent.ThreadPoolExecutor.runWorker(ThreadPoolExecutor.java:1128)
02:15:43 at java.base/java.util.concurrent.ThreadPoolExecutor$Worker.run(ThreadPoolExecutor.java:628)
02:15:43 at java.base/java.lang.Thread.run(Thread.java:829)
02:15:43 Caused by: Ice.CommunicatorDestroyedException: null
02:15:43 at IceInternal.Instance.proxyFactory(Instance.java:239)
02:15:43 at IceInternal.BasicStream.writeProxy(BasicStream.java:2142)
02:15:43 at omero.api.ServiceInterfacePrxHelper.__write(ServiceInterfacePrxHelper.java:114)
02:15:43 at omero.api.ServiceListHelper.write(ServiceListHelper.java:37)
02:15:43 at omero.api.ServiceFactoryPrxHelper.begin_keepAllAlive(ServiceFactoryPrxHelper.java:5946)
02:15:43 at omero.api.ServiceFactoryPrxHelper.keepAllAlive(ServiceFactoryPrxHelper.java:5846)
02:15:43 at omero.api.ServiceFactoryPrxHelper.keepAllAlive(ServiceFactoryPrxHelper.java:5833)
02:15:43 at ome.formats.OMEROMetadataStoreClient.ping(OMEROMetadataStoreClient.java:838)
02:15:43 ... 7 common frames omitted
02:15:44 2025-03-07 02:15:44,316 ERROR [ o.formats.importer.util.ClientKeepAlive] (7-thread-1) Exception while executing ping(), logging Connector out:
02:15:44 java.lang.RuntimeException: Ice.CommunicatorDestroyedException
02:15:44 at ome.formats.OMEROMetadataStoreClient.ping(OMEROMetadataStoreClient.java:845)
02:15:44 at ome.formats.importer.util.ClientKeepAlive.run(ClientKeepAlive.java:77)
02:15:44 at java.base/java.util.concurrent.Executors$RunnableAdapter.call(Executors.java:515)
02:15:44 at java.base/java.util.concurrent.FutureTask.runAndReset(FutureTask.java:305)
02:15:44 at java.base/java.util.concurrent.ScheduledThreadPoolExecutor$ScheduledFutureTask.run(ScheduledThreadPoolExecutor.java:305)
02:15:44 at java.base/java.util.concurrent.ThreadPoolExecutor.runWorker(ThreadPoolExecutor.java:1128)
02:15:44 at java.base/java.util.concurrent.ThreadPoolExecutor$Worker.run(ThreadPoolExecutor.java:628)
02:15:44 at java.base/java.lang.Thread.run(Thread.java:829)
02:15:44 Caused by: Ice.CommunicatorDestroyedException: null
02:15:44 at IceInternal.Instance.proxyFactory(Instance.java:239)
02:15:44 at IceInternal.BasicStream.writeProxy(BasicStream.java:2142)
02:15:44 at omero.api.ServiceInterfacePrxHelper.__write(ServiceInterfacePrxHelper.java:114)
02:15:44 at omero.api.ServiceListHelper.write(ServiceListHelper.java:37)
02:15:44 at omero.api.ServiceFactoryPrxHelper.begin_keepAllAlive(ServiceFactoryPrxHelper.java:5946)
02:15:44 at omero.api.ServiceFactoryPrxHelper.keepAllAlive(ServiceFactoryPrxHelper.java:5846)
02:15:44 at omero.api.ServiceFactoryPrxHelper.keepAllAlive(ServiceFactoryPrxHelper.java:5833)
02:15:44 at ome.formats.OMEROMetadataStoreClient.ping(OMEROMetadataStoreClient.java:838)
02:15:44 ... 7 common frames omitted
02:15:47 ===============================================
02:15:47 OmeroJava.integration
02:15:47 Total tests run: 2589, Passes: 2589, Failures: 0, Skips: 0
02:15:47 ===============================================
02:15:49
02:15:49 BUILD SUCCESSFUL
02:15:49 Total time: 64 minutes 17 seconds
02:15:49 + /home/omero/workspace/OMERO-test-integration/src/build.py -f components/tools/OmeroPy/build.xml integration -Dtestreports.dir=target/reports/integration
02:15:49 OpenJDK 64-Bit Server VM warning: Ignoring option MaxPermSize; support was removed in 8.0
02:15:49 Buildfile: /home/omero/workspace/OMERO-test-integration/src/components/tools/OmeroPy/build.xml
02:15:49 Entering /home/omero/workspace/OMERO-test-integration/src/components/tools/OmeroPy...
02:15:49 Entering /home/omero/workspace/OMERO-test-integration/src/components/tools/OmeroPy...
02:15:49
02:15:49 python-integration:
02:15:49 Created dir: /home/omero/workspace/OMERO-test-integration/src/components/tools/OmeroPy/target/reports/integration
02:15:50 ============================= test session starts ==============================
02:15:50 platform linux -- Python 3.9.18, pytest-8.3.5, pluggy-1.5.0 -- /home/omero/workspace/OMERO-test-integration/.venv3/bin/python3
02:15:50 cachedir: .pytest_cache
02:15:50 django: version: 4.2.20, settings: omeroweb.settings (from ini)
02:15:50 rootdir: /home/omero/workspace/OMERO-test-integration/src/components/tools
02:15:50 configfile: pytest.ini
02:15:50 plugins: xdist-3.6.1, mock-3.14.0, django-4.10.0
02:15:55 collecting ... collected 2061 items / 36 deselected / 2025 selected
02:15:58 test/integration/clitest/test_admin.py::TestAdmin::test_checkupgrade0 PASSED [ 0%]
02:15:58 test/integration/clitest/test_admin.py::TestAdmin::test_checkupgrade1 PASSED [ 0%]
02:15:59 test/integration/clitest/test_admin.py::TestAdmin::test_log PASSED [ 0%]
02:16:03 test/integration/clitest/test_admin.py::TestAdminRestrictedAdmin::test_log PASSED [ 0%]
02:16:03 test/integration/clitest/test_admin.py::TestAdminRestrictedAdmin::test_checkupgrade0 PASSED [ 0%]
02:16:04 test/integration/clitest/test_admin.py::TestAdminRestrictedAdmin::test_checkupgrade1 PASSED [ 0%]
02:16:06 test/integration/clitest/test_chgrp.py::TestChgrp::testChgrpMyData[-rw-----Image] PASSED [ 0%]
02:16:06 test/integration/clitest/test_chgrp.py::TestChgrp::testChgrpMyData[-rw-----Dataset] PASSED [ 0%]
02:16:07 test/integration/clitest/test_chgrp.py::TestChgrp::testChgrpMyData[-rw-----Project] PASSED [ 0%]
02:16:07 test/integration/clitest/test_chgrp.py::TestChgrp::testChgrpMyData[-rw-----Plate] PASSED [ 0%]
02:16:07 test/integration/clitest/test_chgrp.py::TestChgrp::testChgrpMyData[-rw-----Screen] PASSED [ 0%]
02:16:07 test/integration/clitest/test_chgrp.py::TestChgrp::testChgrpMyData[-rwr----Image] PASSED [ 0%]
02:16:07 test/integration/clitest/test_chgrp.py::TestChgrp::testChgrpMyData[-rwr----Dataset] PASSED [ 0%]
02:16:07 test/integration/clitest/test_chgrp.py::TestChgrp::testChgrpMyData[-rwr----Project] PASSED [ 0%]
02:16:07 test/integration/clitest/test_chgrp.py::TestChgrp::testChgrpMyData[-rwr----Plate] PASSED [ 0%]
02:16:07 test/integration/clitest/test_chgrp.py::TestChgrp::testChgrpMyData[-rwr----Screen] PASSED [ 0%]
02:16:07 test/integration/clitest/test_chgrp.py::TestChgrp::testChgrpMyData[-rwra---Image] PASSED [ 0%]
02:16:07 test/integration/clitest/test_chgrp.py::TestChgrp::testChgrpMyData[-rwra---Dataset] PASSED [ 0%]
02:16:07 test/integration/clitest/test_chgrp.py::TestChgrp::testChgrpMyData[-rwra---Project] PASSED [ 0%]
02:16:08 test/integration/clitest/test_chgrp.py::TestChgrp::testChgrpMyData[-rwra---Plate] PASSED [ 0%]
02:16:08 test/integration/clitest/test_chgrp.py::TestChgrp::testChgrpMyData[-rwra---Screen] PASSED [ 1%]
02:16:08 test/integration/clitest/test_chgrp.py::TestChgrp::testChgrpMyData[-rwrw---Image] PASSED [ 1%]
02:16:08 test/integration/clitest/test_chgrp.py::TestChgrp::testChgrpMyData[-rwrw---Dataset] PASSED [ 1%]
02:16:08 test/integration/clitest/test_chgrp.py::TestChgrp::testChgrpMyData[-rwrw---Project] PASSED [ 1%]
02:16:08 test/integration/clitest/test_chgrp.py::TestChgrp::testChgrpMyData[-rwrw---Plate] PASSED [ 1%]
02:16:08 test/integration/clitest/test_chgrp.py::TestChgrp::testChgrpMyData[-rwrw---Screen] PASSED [ 1%]
02:16:08 test/integration/clitest/test_chgrp.py::TestChgrp::testChgrpMyData[Group:-rw-----Image] PASSED [ 1%]
02:16:08 test/integration/clitest/test_chgrp.py::TestChgrp::testChgrpMyData[Group:-rw-----Dataset] PASSED [ 1%]
02:16:08 test/integration/clitest/test_chgrp.py::TestChgrp::testChgrpMyData[Group:-rw-----Project] PASSED [ 1%]
02:16:08 test/integration/clitest/test_chgrp.py::TestChgrp::testChgrpMyData[Group:-rw-----Plate] PASSED [ 1%]
02:16:08 test/integration/clitest/test_chgrp.py::TestChgrp::testChgrpMyData[Group:-rw-----Screen] PASSED [ 1%]
02:16:08 test/integration/clitest/test_chgrp.py::TestChgrp::testChgrpMyData[Group:-rwr----Image] PASSED [ 1%]
02:16:08 test/integration/clitest/test_chgrp.py::TestChgrp::testChgrpMyData[Group:-rwr----Dataset] PASSED [ 1%]
02:16:09 test/integration/clitest/test_chgrp.py::TestChgrp::testChgrpMyData[Group:-rwr----Project] PASSED [ 1%]
02:16:09 test/integration/clitest/test_chgrp.py::TestChgrp::testChgrpMyData[Group:-rwr----Plate] PASSED [ 1%]
02:16:09 test/integration/clitest/test_chgrp.py::TestChgrp::testChgrpMyData[Group:-rwr----Screen] PASSED [ 1%]
02:16:09 test/integration/clitest/test_chgrp.py::TestChgrp::testChgrpMyData[Group:-rwra---Image] PASSED [ 1%]
02:16:09 test/integration/clitest/test_chgrp.py::TestChgrp::testChgrpMyData[Group:-rwra---Dataset] PASSED [ 1%]
02:16:09 test/integration/clitest/test_chgrp.py::TestChgrp::testChgrpMyData[Group:-rwra---Project] PASSED [ 1%]
02:16:09 test/integration/clitest/test_chgrp.py::TestChgrp::testChgrpMyData[Group:-rwra---Plate] PASSED [ 1%]
02:16:10 test/integration/clitest/test_chgrp.py::TestChgrp::testChgrpMyData[Group:-rwra---Screen] PASSED [ 2%]
02:16:10 test/integration/clitest/test_chgrp.py::TestChgrp::testChgrpMyData[Group:-rwrw---Image] PASSED [ 2%]
02:16:10 test/integration/clitest/test_chgrp.py::TestChgrp::testChgrpMyData[Group:-rwrw---Dataset] PASSED [ 2%]
02:16:10 test/integration/clitest/test_chgrp.py::TestChgrp::testChgrpMyData[Group:-rwrw---Project] PASSED [ 2%]
02:16:10 test/integration/clitest/test_chgrp.py::TestChgrp::testChgrpMyData[Group:-rwrw---Plate] PASSED [ 2%]
02:16:10 test/integration/clitest/test_chgrp.py::TestChgrp::testChgrpMyData[Group:-rwrw---Screen] PASSED [ 2%]
02:16:10 test/integration/clitest/test_chgrp.py::TestChgrp::testChgrpMyData[ExperimenterGroup:-rw-----Image] PASSED [ 2%]
02:16:10 test/integration/clitest/test_chgrp.py::TestChgrp::testChgrpMyData[ExperimenterGroup:-rw-----Dataset] PASSED [ 2%]
02:16:10 test/integration/clitest/test_chgrp.py::TestChgrp::testChgrpMyData[ExperimenterGroup:-rw-----Project] PASSED [ 2%]
02:16:10 test/integration/clitest/test_chgrp.py::TestChgrp::testChgrpMyData[ExperimenterGroup:-rw-----Plate] PASSED [ 2%]
02:16:10 test/integration/clitest/test_chgrp.py::TestChgrp::testChgrpMyData[ExperimenterGroup:-rw-----Screen] PASSED [ 2%]
02:16:11 test/integration/clitest/test_chgrp.py::TestChgrp::testChgrpMyData[ExperimenterGroup:-rwr----Image] PASSED [ 2%]
02:16:11 test/integration/clitest/test_chgrp.py::TestChgrp::testChgrpMyData[ExperimenterGroup:-rwr----Dataset] PASSED [ 2%]
02:16:11 test/integration/clitest/test_chgrp.py::TestChgrp::testChgrpMyData[ExperimenterGroup:-rwr----Project] PASSED [ 2%]
02:16:11 test/integration/clitest/test_chgrp.py::TestChgrp::testChgrpMyData[ExperimenterGroup:-rwr----Plate] PASSED [ 2%]
02:16:11 test/integration/clitest/test_chgrp.py::TestChgrp::testChgrpMyData[ExperimenterGroup:-rwr----Screen] PASSED [ 2%]
02:16:11 test/integration/clitest/test_chgrp.py::TestChgrp::testChgrpMyData[ExperimenterGroup:-rwra---Image] PASSED [ 2%]
02:16:11 test/integration/clitest/test_chgrp.py::TestChgrp::testChgrpMyData[ExperimenterGroup:-rwra---Dataset] PASSED [ 2%]
02:16:11 test/integration/clitest/test_chgrp.py::TestChgrp::testChgrpMyData[ExperimenterGroup:-rwra---Project] PASSED [ 2%]
02:16:11 test/integration/clitest/test_chgrp.py::TestChgrp::testChgrpMyData[ExperimenterGroup:-rwra---Plate] PASSED [ 2%]
02:16:11 test/integration/clitest/test_chgrp.py::TestChgrp::testChgrpMyData[ExperimenterGroup:-rwra---Screen] PASSED [ 3%]
02:16:11 test/integration/clitest/test_chgrp.py::TestChgrp::testChgrpMyData[ExperimenterGroup:-rwrw---Image] PASSED [ 3%]
02:16:11 test/integration/clitest/test_chgrp.py::TestChgrp::testChgrpMyData[ExperimenterGroup:-rwrw---Dataset] PASSED [ 3%]
02:16:11 test/integration/clitest/test_chgrp.py::TestChgrp::testChgrpMyData[ExperimenterGroup:-rwrw---Project] PASSED [ 3%]
02:16:11 test/integration/clitest/test_chgrp.py::TestChgrp::testChgrpMyData[ExperimenterGroup:-rwrw---Plate] PASSED [ 3%]
02:16:11 test/integration/clitest/test_chgrp.py::TestChgrp::testChgrpMyData[ExperimenterGroup:-rwrw---Screen] PASSED [ 3%]
02:16:11 test/integration/clitest/test_chgrp.py::TestChgrp::testNonMember PASSED [ 3%]
02:16:12 test/integration/clitest/test_chgrp.py::TestChgrp::testGroupName PASSED [ 3%]
02:16:16 test/integration/clitest/test_chgrp.py::TestChgrp::testFileset PASSED [ 3%]
02:16:19 test/integration/clitest/test_chgrp.py::TestChgrp::testFilesetPartialFailing PASSED [ 3%]
02:16:22 test/integration/clitest/test_chgrp.py::TestChgrp::testFilesetOneImage PASSED [ 3%]
02:16:26 test/integration/clitest/test_chgrp.py::TestChgrp::testFilesetAllImagesMoveImages PASSED [ 3%]
02:16:29 test/integration/clitest/test_chgrp.py::TestChgrp::testFilesetAllImagesMoveDataset PASSED [ 3%]
02:16:29 test/integration/clitest/test_chgrp.py::TestChgrp::testNonExistingGroupId[] PASSED [ 3%]
02:16:29 test/integration/clitest/test_chgrp.py::TestChgrp::testNonExistingGroupId[Group:] PASSED [ 3%]
02:16:29 test/integration/clitest/test_chgrp.py::TestChgrp::testNonExistingGroupId[ExperimenterGroup:] PASSED [ 3%]
02:16:29 test/integration/clitest/test_chgrp.py::TestChgrp::testNonExistingGroupName PASSED [ 3%]
02:16:29 test/integration/clitest/test_chgrp.py::TestChgrp::testMultipleSimpleObjectsSameClass[True-1] PASSED [ 3%]
02:16:29 test/integration/clitest/test_chgrp.py::TestChgrp::testMultipleSimpleObjectsSameClass[True-2] PASSED [ 3%]
02:16:30 test/integration/clitest/test_chgrp.py::TestChgrp::testMultipleSimpleObjectsSameClass[True-3] PASSED [ 3%]
02:16:30 test/integration/clitest/test_chgrp.py::TestChgrp::testMultipleSimpleObjectsSameClass[False-1] PASSED [ 4%]
02:16:30 test/integration/clitest/test_chgrp.py::TestChgrp::testMultipleSimpleObjectsSameClass[False-2] PASSED [ 4%]
02:16:30 test/integration/clitest/test_chgrp.py::TestChgrp::testMultipleSimpleObjectsSameClass[False-3] PASSED [ 4%]
02:16:30 test/integration/clitest/test_chgrp.py::TestChgrp::testMultipleSimpleObjectsTwoClassesSeparated[True-1] PASSED [ 4%]
02:16:30 test/integration/clitest/test_chgrp.py::TestChgrp::testMultipleSimpleObjectsTwoClassesSeparated[True-2] PASSED [ 4%]
02:16:30 test/integration/clitest/test_chgrp.py::TestChgrp::testMultipleSimpleObjectsTwoClassesSeparated[True-3] PASSED [ 4%]
02:16:31 test/integration/clitest/test_chgrp.py::TestChgrp::testMultipleSimpleObjectsTwoClassesSeparated[False-1] PASSED [ 4%]
02:16:31 test/integration/clitest/test_chgrp.py::TestChgrp::testMultipleSimpleObjectsTwoClassesSeparated[False-2] PASSED [ 4%]
02:16:31 test/integration/clitest/test_chgrp.py::TestChgrp::testMultipleSimpleObjectsTwoClassesSeparated[False-3] PASSED [ 4%]
02:16:31 test/integration/clitest/test_chgrp.py::TestChgrp::testMultipleSimpleObjectsTwoClassesInterlaced[True-1] PASSED [ 4%]
02:16:31 test/integration/clitest/test_chgrp.py::TestChgrp::testMultipleSimpleObjectsTwoClassesInterlaced[True-2] PASSED [ 4%]
02:16:31 test/integration/clitest/test_chgrp.py::TestChgrp::testMultipleSimpleObjectsTwoClassesInterlaced[True-3] PASSED [ 4%]
02:16:31 test/integration/clitest/test_chgrp.py::TestChgrp::testMultipleSimpleObjectsTwoClassesInterlaced[False-1] PASSED [ 4%]
02:16:31 test/integration/clitest/test_chgrp.py::TestChgrp::testMultipleSimpleObjectsTwoClassesInterlaced[False-2] PASSED [ 4%]
02:16:32 test/integration/clitest/test_chgrp.py::TestChgrp::testMultipleSimpleObjectsTwoClassesInterlaced[False-3] PASSED [ 4%]
02:16:32 test/integration/clitest/test_chgrp.py::TestChgrp::testBasicSkipheadBothForms[True-1-/Dataset] PASSED [ 4%]
02:16:32 test/integration/clitest/test_chgrp.py::TestChgrp::testBasicSkipheadBothForms[True-1-] PASSED [ 4%]
02:16:32 test/integration/clitest/test_chgrp.py::TestChgrp::testBasicSkipheadBothForms[True-2-/Dataset] PASSED [ 4%]
02:16:32 test/integration/clitest/test_chgrp.py::TestChgrp::testBasicSkipheadBothForms[True-2-] PASSED [ 4%]
02:16:33 test/integration/clitest/test_chgrp.py::TestChgrp::testBasicSkipheadBothForms[False-1-/Dataset] PASSED [ 4%]
02:16:33 test/integration/clitest/test_chgrp.py::TestChgrp::testBasicSkipheadBothForms[False-1-] PASSED [ 4%]
02:16:33 test/integration/clitest/test_chgrp.py::TestChgrp::testBasicSkipheadBothForms[False-2-/Dataset] PASSED [ 5%]
02:16:33 test/integration/clitest/test_chgrp.py::TestChgrp::testBasicSkipheadBothForms[False-2-] PASSED [ 5%]
02:16:33 test/integration/clitest/test_chgrp.py::TestChgrp::testMultipleSkipheadsSameClass[True-1] PASSED [ 5%]
02:16:34 test/integration/clitest/test_chgrp.py::TestChgrp::testMultipleSkipheadsSameClass[True-2] PASSED [ 5%]
02:16:34 test/integration/clitest/test_chgrp.py::TestChgrp::testMultipleSkipheadsSameClass[True-3] PASSED [ 5%]
02:16:34 test/integration/clitest/test_chgrp.py::TestChgrp::testMultipleSkipheadsSameClass[False-1] PASSED [ 5%]
02:16:35 test/integration/clitest/test_chgrp.py::TestChgrp::testMultipleSkipheadsSameClass[False-2] PASSED [ 5%]
02:16:35 test/integration/clitest/test_chgrp.py::TestChgrp::testMultipleSkipheadsSameClass[False-3] PASSED [ 5%]
02:16:35 test/integration/clitest/test_chgrp.py::TestChgrp::testMultipleSkipheadsPlusObjectsSeparated[True-1] PASSED [ 5%]
02:16:35 test/integration/clitest/test_chgrp.py::TestChgrp::testMultipleSkipheadsPlusObjectsSeparated[True-2] PASSED [ 5%]
02:16:36 test/integration/clitest/test_chgrp.py::TestChgrp::testMultipleSkipheadsPlusObjectsSeparated[True-3] PASSED [ 5%]
02:16:36 test/integration/clitest/test_chgrp.py::TestChgrp::testMultipleSkipheadsPlusObjectsSeparated[False-1] PASSED [ 5%]
02:16:36 test/integration/clitest/test_chgrp.py::TestChgrp::testMultipleSkipheadsPlusObjectsSeparated[False-2] PASSED [ 5%]
02:16:37 test/integration/clitest/test_chgrp.py::TestChgrp::testMultipleSkipheadsPlusObjectsSeparated[False-3] PASSED [ 5%]
02:16:37 test/integration/clitest/test_chgrp.py::TestChgrp::testMultipleSkipheadsPlusObjectsInterlaced[True-1] PASSED [ 5%]
02:16:37 test/integration/clitest/test_chgrp.py::TestChgrp::testMultipleSkipheadsPlusObjectsInterlaced[True-2] PASSED [ 5%]
02:16:38 test/integration/clitest/test_chgrp.py::TestChgrp::testMultipleSkipheadsPlusObjectsInterlaced[True-3] PASSED [ 5%]
02:16:38 test/integration/clitest/test_chgrp.py::TestChgrp::testMultipleSkipheadsPlusObjectsInterlaced[False-1] PASSED [ 5%]
02:16:38 test/integration/clitest/test_chgrp.py::TestChgrp::testMultipleSkipheadsPlusObjectsInterlaced[False-2] PASSED [ 5%]
02:16:38 test/integration/clitest/test_chgrp.py::TestChgrp::testMultipleSkipheadsPlusObjectsInterlaced[False-3] PASSED [ 5%]
02:16:41 test/integration/clitest/test_chgrp.py::TestChgrpRoot::testNonMember PASSED [ 6%]
02:16:44 test/integration/clitest/test_chown.py::TestChown::testChownBasicUsageWithId[-Image] PASSED [ 6%]
02:16:46 test/integration/clitest/test_chown.py::TestChown::testChownBasicUsageWithId[-Dataset] PASSED [ 6%]
02:16:48 test/integration/clitest/test_chown.py::TestChown::testChownBasicUsageWithId[-Project] PASSED [ 6%]
02:16:50 test/integration/clitest/test_chown.py::TestChown::testChownBasicUsageWithId[-Plate] PASSED [ 6%]
02:16:52 test/integration/clitest/test_chown.py::TestChown::testChownBasicUsageWithId[-Screen] PASSED [ 6%]
02:16:53 test/integration/clitest/test_chown.py::TestChown::testChownBasicUsageWithId[User:-Image] PASSED [ 6%]
02:16:55 test/integration/clitest/test_chown.py::TestChown::testChownBasicUsageWithId[User:-Dataset] PASSED [ 6%]
02:16:57 test/integration/clitest/test_chown.py::TestChown::testChownBasicUsageWithId[User:-Project] PASSED [ 6%]
02:16:59 test/integration/clitest/test_chown.py::TestChown::testChownBasicUsageWithId[User:-Plate] PASSED [ 6%]
02:17:01 test/integration/clitest/test_chown.py::TestChown::testChownBasicUsageWithId[User:-Screen] PASSED [ 6%]
02:17:02 test/integration/clitest/test_chown.py::TestChown::testChownBasicUsageWithId[Experimenter:-Image] PASSED [ 6%]
02:17:04 test/integration/clitest/test_chown.py::TestChown::testChownBasicUsageWithId[Experimenter:-Dataset] PASSED [ 6%]
02:17:06 test/integration/clitest/test_chown.py::TestChown::testChownBasicUsageWithId[Experimenter:-Project] PASSED [ 6%]
02:17:08 test/integration/clitest/test_chown.py::TestChown::testChownBasicUsageWithId[Experimenter:-Plate] PASSED [ 6%]
02:17:10 test/integration/clitest/test_chown.py::TestChown::testChownBasicUsageWithId[Experimenter:-Screen] PASSED [ 6%]
02:17:14 test/integration/clitest/test_chown.py::TestChown::testChownBasicUsageTargetUser PASSED [ 6%]
02:17:16 test/integration/clitest/test_chown.py::TestChown::testChownBasicUsageWithName[-] PASSED [ 6%]
02:17:18 test/integration/clitest/test_chown.py::TestChown::testChownBasicUsageWithName[-/] PASSED [ 6%]
02:17:19 test/integration/clitest/test_chown.py::TestChown::testChownBasicUsageWithName[I-] PASSED [ 6%]
02:17:21 test/integration/clitest/test_chown.py::TestChown::testChownBasicUsageWithName[I-/] PASSED [ 7%]
02:17:23 test/integration/clitest/test_chown.py::TestChown::testChownDifferentGroup PASSED [ 7%]
02:17:28 test/integration/clitest/test_chown.py::TestChown::testFileset[image-1] PASSED [ 7%]
02:17:34 test/integration/clitest/test_chown.py::TestChown::testFileset[image-2] PASSED [ 7%]
02:17:39 test/integration/clitest/test_chown.py::TestChown::testFileset[fileset-1] PASSED [ 7%]
02:17:44 test/integration/clitest/test_chown.py::TestChown::testFileset[fileset-2] PASSED [ 7%]
02:17:50 test/integration/clitest/test_chown.py::TestChown::testFilesetPartialFailing PASSED [ 7%]
02:17:55 test/integration/clitest/test_chown.py::TestChown::testFilesetAllImagesChownDataset PASSED [ 7%]
02:17:57 test/integration/clitest/test_chown.py::TestChown::testMultipleSimpleObjectsSameClass[True-1] PASSED [ 7%]
02:17:59 test/integration/clitest/test_chown.py::TestChown::testMultipleSimpleObjectsSameClass[True-2] PASSED [ 7%]
02:18:01 test/integration/clitest/test_chown.py::TestChown::testMultipleSimpleObjectsSameClass[True-3] PASSED [ 7%]
02:18:03 test/integration/clitest/test_chown.py::TestChown::testMultipleSimpleObjectsSameClass[False-1] PASSED [ 7%]
02:18:05 test/integration/clitest/test_chown.py::TestChown::testMultipleSimpleObjectsSameClass[False-2] PASSED [ 7%]
02:18:07 test/integration/clitest/test_chown.py::TestChown::testMultipleSimpleObjectsSameClass[False-3] PASSED [ 7%]
02:18:09 test/integration/clitest/test_chown.py::TestChown::testMultipleSimpleObjectsTwoClassesSeparated[True-1] PASSED [ 7%]
02:18:11 test/integration/clitest/test_chown.py::TestChown::testMultipleSimpleObjectsTwoClassesSeparated[True-2] PASSED [ 7%]
02:18:13 test/integration/clitest/test_chown.py::TestChown::testMultipleSimpleObjectsTwoClassesSeparated[True-3] PASSED [ 7%]
02:18:15 test/integration/clitest/test_chown.py::TestChown::testMultipleSimpleObjectsTwoClassesSeparated[False-1] PASSED [ 7%]
02:18:17 test/integration/clitest/test_chown.py::TestChown::testMultipleSimpleObjectsTwoClassesSeparated[False-2] PASSED [ 7%]
02:18:19 test/integration/clitest/test_chown.py::TestChown::testMultipleSimpleObjectsTwoClassesSeparated[False-3] PASSED [ 7%]
02:18:21 test/integration/clitest/test_chown.py::TestChown::testMultipleSimpleObjectsTwoClassesInterlaced[True-1] PASSED [ 8%]
02:18:23 test/integration/clitest/test_chown.py::TestChown::testMultipleSimpleObjectsTwoClassesInterlaced[True-2] PASSED [ 8%]
02:18:25 test/integration/clitest/test_chown.py::TestChown::testMultipleSimpleObjectsTwoClassesInterlaced[True-3] PASSED [ 8%]
02:18:27 test/integration/clitest/test_chown.py::TestChown::testMultipleSimpleObjectsTwoClassesInterlaced[False-1] PASSED [ 8%]
02:18:29 test/integration/clitest/test_chown.py::TestChown::testMultipleSimpleObjectsTwoClassesInterlaced[False-2] PASSED [ 8%]
02:18:31 test/integration/clitest/test_chown.py::TestChown::testMultipleSimpleObjectsTwoClassesInterlaced[False-3] PASSED [ 8%]
02:18:33 test/integration/clitest/test_chown.py::TestChown::testBasicSkipheadBothForms[True-1-/Dataset] PASSED [ 8%]
02:18:35 test/integration/clitest/test_chown.py::TestChown::testBasicSkipheadBothForms[True-1-] PASSED [ 8%]
02:18:37 test/integration/clitest/test_chown.py::TestChown::testBasicSkipheadBothForms[True-2-/Dataset] PASSED [ 8%]
02:18:40 test/integration/clitest/test_chown.py::TestChown::testBasicSkipheadBothForms[True-2-] PASSED [ 8%]
02:18:42 test/integration/clitest/test_chown.py::TestChown::testBasicSkipheadBothForms[False-1-/Dataset] PASSED [ 8%]
02:18:44 test/integration/clitest/test_chown.py::TestChown::testBasicSkipheadBothForms[False-1-] PASSED [ 8%]
02:18:46 test/integration/clitest/test_chown.py::TestChown::testBasicSkipheadBothForms[False-2-/Dataset] PASSED [ 8%]
02:18:48 test/integration/clitest/test_chown.py::TestChown::testBasicSkipheadBothForms[False-2-] PASSED [ 8%]
02:18:50 test/integration/clitest/test_chown.py::TestChown::testMultipleSkipheadsPlusObjectsSeparated[True-1] PASSED [ 8%]
02:18:53 test/integration/clitest/test_chown.py::TestChown::testMultipleSkipheadsPlusObjectsSeparated[True-2] PASSED [ 8%]
02:18:55 test/integration/clitest/test_chown.py::TestChown::testMultipleSkipheadsPlusObjectsSeparated[True-3] PASSED [ 8%]
02:18:58 test/integration/clitest/test_chown.py::TestChown::testMultipleSkipheadsPlusObjectsSeparated[False-1] PASSED [ 8%]
02:19:00 test/integration/clitest/test_chown.py::TestChown::testMultipleSkipheadsPlusObjectsSeparated[False-2] PASSED [ 8%]
02:19:03 test/integration/clitest/test_chown.py::TestChown::testMultipleSkipheadsPlusObjectsSeparated[False-3] PASSED [ 8%]
02:19:05 test/integration/clitest/test_chown.py::TestChown::testMultipleSkipheadsPlusObjectsInterlaced[True-1] PASSED [ 8%]
02:19:07 test/integration/clitest/test_chown.py::TestChown::testMultipleSkipheadsPlusObjectsInterlaced[True-2] PASSED [ 9%]
02:19:11 test/integration/clitest/test_chown.py::TestChown::testMultipleSkipheadsPlusObjectsInterlaced[True-3] PASSED [ 9%]
02:19:13 test/integration/clitest/test_chown.py::TestChown::testMultipleSkipheadsPlusObjectsInterlaced[False-1] PASSED [ 9%]
02:19:16 test/integration/clitest/test_chown.py::TestChown::testMultipleSkipheadsPlusObjectsInterlaced[False-2] PASSED [ 9%]
02:19:19 test/integration/clitest/test_chown.py::TestChown::testMultipleSkipheadsPlusObjectsInterlaced[False-3] PASSED [ 9%]
02:19:21 test/integration/clitest/test_chown.py::TestChown::testDryRun PASSED [ 9%]
02:19:23 test/integration/clitest/test_chown.py::TestChown::testExcludeNone PASSED [ 9%]
02:19:25 test/integration/clitest/test_chown.py::TestChown::testExcludeDataset PASSED [ 9%]
02:19:27 test/integration/clitest/test_chown.py::TestChown::testExcludeImage PASSED [ 9%]
02:19:29 test/integration/clitest/test_chown.py::TestChown::testExcludeOverridesInclude PASSED [ 9%]
02:19:31 test/integration/clitest/test_chown.py::TestChown::testSeparateAnnotationTransfer PASSED [ 9%]
02:19:34 test/integration/clitest/test_chown.py::TestChown::testOutputWithElision PASSED [ 9%]
02:19:37 test/integration/clitest/test_chown.py::TestTagChown::testChownOneTagSetWithUniqueTags PASSED [ 9%]
02:19:41 test/integration/clitest/test_chown.py::TestChownRoot::testChownBasicUsageWithId PASSED [ 9%]
02:19:45 test/integration/clitest/test_chown.py::TestChownNonGroupOwner::testChownBasicUsageWithId PASSED [ 9%]
02:19:47 test/integration/clitest/test_cleanse.py::TestCleanse::testCleanseAdminOnly PASSED [ 9%]
02:20:00 test/integration/clitest/test_cleanse.py::TestCleanseFullAdmin::testCleanseBasic PASSED [ 9%]
02:20:20 test/integration/clitest/test_cleanse.py::TestCleanseFullAdmin::testCleanseNonsenseName PASSED [ 9%]
02:20:22 test/integration/clitest/test_cleanse.py::TestCleanseRestrictedAdmin::test_cleanse_restricted_admin PASSED [ 9%]
02:20:23 test/integration/clitest/test_cleanse.py::TestFixPyramids::test_fixpyramids_admin_only PASSED [ 9%]
02:20:25 test/integration/clitest/test_cleanse.py::TestFixPyramidsRestrictedAdmin::test_fixpyramids_restricted_admin PASSED [ 10%]
02:20:26 test/integration/clitest/test_db.py::TestDatabase::testBadVersionDies PASSED [ 10%]
02:20:26 test/integration/clitest/test_db.py::TestDatabase::testPasswordIsAskedForAgainIfDiffer PASSED [ 10%]
02:20:27 test/integration/clitest/test_db.py::TestDatabase::testPasswordIsAskedForAgainIfEmpty PASSED [ 10%]
02:20:27 test/integration/clitest/test_db.py::TestDatabase::testPassword[--] PASSED [ 10%]
02:20:27 test/integration/clitest/test_db.py::TestDatabase::testPassword[----no-salt] PASSED [ 10%]
02:20:28 test/integration/clitest/test_db.py::TestDatabase::testPassword[-0-] PASSED [ 10%]
02:20:28 test/integration/clitest/test_db.py::TestDatabase::testPassword[-0---no-salt] PASSED [ 10%]
02:20:29 test/integration/clitest/test_db.py::TestDatabase::testPassword[-1-] PASSED [ 10%]
02:20:29 test/integration/clitest/test_db.py::TestDatabase::testPassword[-1---no-salt] PASSED [ 10%]
02:20:30 test/integration/clitest/test_db.py::TestDatabase::testPassword[ome--] PASSED [ 10%]
02:20:30 test/integration/clitest/test_db.py::TestDatabase::testPassword[ome----no-salt] PASSED [ 10%]
02:20:31 test/integration/clitest/test_db.py::TestDatabase::testPassword[ome-0-] PASSED [ 10%]
02:20:31 test/integration/clitest/test_db.py::TestDatabase::testPassword[ome-0---no-salt] PASSED [ 10%]
02:20:31 test/integration/clitest/test_db.py::TestDatabase::testPassword[ome-1-] PASSED [ 10%]
02:20:32 test/integration/clitest/test_db.py::TestDatabase::testPassword[ome-1---no-salt] PASSED [ 10%]
02:20:33 test/integration/clitest/test_db.py::TestDatabase::testScript[--] PASSED [ 10%]
02:20:34 test/integration/clitest/test_db.py::TestDatabase::testScript[---f] PASSED [ 10%]
02:20:35 test/integration/clitest/test_db.py::TestDatabase::testScript[----file] PASSED [ 10%]
02:20:36 test/integration/clitest/test_db.py::TestDatabase::testScript[---no-salt-] PASSED [ 10%]
02:20:37 test/integration/clitest/test_db.py::TestDatabase::testScript[---no-salt--f] PASSED [ 11%]
02:20:38 test/integration/clitest/test_db.py::TestDatabase::testScript[---no-salt---file] PASSED [ 11%]
02:20:40 test/integration/clitest/test_db.py::TestDatabase::testScript[--password ome--] PASSED [ 11%]
02:20:41 test/integration/clitest/test_db.py::TestDatabase::testScript[--password ome---f] PASSED [ 11%]
02:20:42 test/integration/clitest/test_db.py::TestDatabase::testScript[--password ome----file] PASSED [ 11%]
02:20:43 test/integration/clitest/test_db.py::TestDatabase::testScript[--password ome---no-salt-] PASSED [ 11%]
02:20:44 test/integration/clitest/test_db.py::TestDatabase::testScript[--password ome---no-salt--f] PASSED [ 11%]
02:20:45 test/integration/clitest/test_db.py::TestDatabase::testScript[--password ome---no-salt---file] PASSED [ 11%]
02:20:45 test/integration/clitest/test_db.py::TestDatabase::testScriptDeveloperArgs[%s %s %s--] PASSED [ 11%]
02:20:46 test/integration/clitest/test_db.py::TestDatabase::testScriptDeveloperArgs[%s %s %s---f] PASSED [ 11%]
02:20:46 test/integration/clitest/test_db.py::TestDatabase::testScriptDeveloperArgs[%s %s %s----file] PASSED [ 11%]
02:20:46 test/integration/clitest/test_db.py::TestDatabase::testScriptDeveloperArgs[%s %s %s---no-salt-] PASSED [ 11%]
02:20:47 test/integration/clitest/test_db.py::TestDatabase::testScriptDeveloperArgs[%s %s %s---no-salt--f] PASSED [ 11%]
02:20:47 test/integration/clitest/test_db.py::TestDatabase::testScriptDeveloperArgs[%s %s %s---no-salt---file] PASSED [ 11%]
02:20:48 test/integration/clitest/test_db.py::TestDatabase::testScriptDeveloperArgs[--version %s --patch %s --password %s--] PASSED [ 11%]
02:20:48 test/integration/clitest/test_db.py::TestDatabase::testScriptDeveloperArgs[--version %s --patch %s --password %s---f] PASSED [ 11%]
02:20:49 test/integration/clitest/test_db.py::TestDatabase::testScriptDeveloperArgs[--version %s --patch %s --password %s----file] PASSED [ 11%]
02:20:49 test/integration/clitest/test_db.py::TestDatabase::testScriptDeveloperArgs[--version %s --patch %s --password %s---no-salt-] PASSED [ 11%]
02:20:49 test/integration/clitest/test_db.py::TestDatabase::testScriptDeveloperArgs[--version %s --patch %s --password %s---no-salt--f] PASSED [ 11%]
02:20:50 test/integration/clitest/test_db.py::TestDatabase::testScriptDeveloperArgs[--version %s --patch %s --password %s---no-salt---file] PASSED [ 11%]
02:20:52 test/integration/clitest/test_delete.py::TestDelete::testDeleteMyData[Image-] PASSED [ 12%]
02:20:52 test/integration/clitest/test_delete.py::TestDelete::testDeleteMyData[Image-I] PASSED [ 12%]
02:20:52 test/integration/clitest/test_delete.py::TestDelete::testDeleteMyData[Dataset-] PASSED [ 12%]
02:20:52 test/integration/clitest/test_delete.py::TestDelete::testDeleteMyData[Dataset-I] PASSED [ 12%]
02:20:52 test/integration/clitest/test_delete.py::TestDelete::testDeleteMyData[Project-] PASSED [ 12%]
02:20:52 test/integration/clitest/test_delete.py::TestDelete::testDeleteMyData[Project-I] PASSED [ 12%]
02:20:52 test/integration/clitest/test_delete.py::TestDelete::testDeleteMyData[Plate-] PASSED [ 12%]
02:20:52 test/integration/clitest/test_delete.py::TestDelete::testDeleteMyData[Plate-I] PASSED [ 12%]
02:20:52 test/integration/clitest/test_delete.py::TestDelete::testDeleteMyData[Screen-] PASSED [ 12%]
02:20:52 test/integration/clitest/test_delete.py::TestDelete::testDeleteMyData[Screen-I] PASSED [ 12%]
02:20:56 test/integration/clitest/test_delete.py::TestDelete::testFileset[image-1] PASSED [ 12%]
02:20:59 test/integration/clitest/test_delete.py::TestDelete::testFileset[image-2] PASSED [ 12%]
02:21:03 test/integration/clitest/test_delete.py::TestDelete::testFileset[fileset-1] PASSED [ 12%]
02:21:06 test/integration/clitest/test_delete.py::TestDelete::testFileset[fileset-2] PASSED [ 12%]
02:21:10 test/integration/clitest/test_delete.py::TestDelete::testFilesetPartialFailing PASSED [ 12%]
02:21:13 test/integration/clitest/test_delete.py::TestDelete::testFilesetAllImagesDeleteDataset PASSED [ 12%]
02:21:13 test/integration/clitest/test_delete.py::TestDelete::testMultipleSimpleObjectsSameClass[True-1] PASSED [ 12%]
02:21:13 test/integration/clitest/test_delete.py::TestDelete::testMultipleSimpleObjectsSameClass[True-2] PASSED [ 12%]
02:21:13 test/integration/clitest/test_delete.py::TestDelete::testMultipleSimpleObjectsSameClass[True-3] PASSED [ 12%]
02:21:13 test/integration/clitest/test_delete.py::TestDelete::testMultipleSimpleObjectsSameClass[False-1] PASSED [ 12%]
02:21:13 test/integration/clitest/test_delete.py::TestDelete::testMultipleSimpleObjectsSameClass[False-2] PASSED [ 12%]
02:21:13 test/integration/clitest/test_delete.py::TestDelete::testMultipleSimpleObjectsSameClass[False-3] PASSED [ 13%]
02:21:14 test/integration/clitest/test_delete.py::TestDelete::testMultipleSimpleObjectsTwoClassesSeparated[True-1] PASSED [ 13%]
02:21:14 test/integration/clitest/test_delete.py::TestDelete::testMultipleSimpleObjectsTwoClassesSeparated[True-2] PASSED [ 13%]
02:21:14 test/integration/clitest/test_delete.py::TestDelete::testMultipleSimpleObjectsTwoClassesSeparated[True-3] PASSED [ 13%]
02:21:14 test/integration/clitest/test_delete.py::TestDelete::testMultipleSimpleObjectsTwoClassesSeparated[False-1] PASSED [ 13%]
02:21:14 test/integration/clitest/test_delete.py::TestDelete::testMultipleSimpleObjectsTwoClassesSeparated[False-2] PASSED [ 13%]
02:21:14 test/integration/clitest/test_delete.py::TestDelete::testMultipleSimpleObjectsTwoClassesSeparated[False-3] PASSED [ 13%]
02:21:14 test/integration/clitest/test_delete.py::TestDelete::testMultipleSimpleObjectsTwoClassesInterlaced[True-1] PASSED [ 13%]
02:21:14 test/integration/clitest/test_delete.py::TestDelete::testMultipleSimpleObjectsTwoClassesInterlaced[True-2] PASSED [ 13%]
02:21:15 test/integration/clitest/test_delete.py::TestDelete::testMultipleSimpleObjectsTwoClassesInterlaced[True-3] PASSED [ 13%]
02:21:15 test/integration/clitest/test_delete.py::TestDelete::testMultipleSimpleObjectsTwoClassesInterlaced[False-1] PASSED [ 13%]
02:21:15 test/integration/clitest/test_delete.py::TestDelete::testMultipleSimpleObjectsTwoClassesInterlaced[False-2] PASSED [ 13%]
02:21:15 test/integration/clitest/test_delete.py::TestDelete::testMultipleSimpleObjectsTwoClassesInterlaced[False-3] PASSED [ 13%]
02:21:15 test/integration/clitest/test_delete.py::TestDelete::testBasicSkipheadBothForms[True-1-/Dataset] PASSED [ 13%]
02:21:15 test/integration/clitest/test_delete.py::TestDelete::testBasicSkipheadBothForms[True-1-] PASSED [ 13%]
02:21:15 test/integration/clitest/test_delete.py::TestDelete::testBasicSkipheadBothForms[True-2-/Dataset] PASSED [ 13%]
02:21:16 test/integration/clitest/test_delete.py::TestDelete::testBasicSkipheadBothForms[True-2-] PASSED [ 13%]
02:21:16 test/integration/clitest/test_delete.py::TestDelete::testBasicSkipheadBothForms[False-1-/Dataset] PASSED [ 13%]
02:21:16 test/integration/clitest/test_delete.py::TestDelete::testBasicSkipheadBothForms[False-1-] PASSED [ 13%]
02:21:16 test/integration/clitest/test_delete.py::TestDelete::testBasicSkipheadBothForms[False-2-/Dataset] PASSED [ 13%]
02:21:16 test/integration/clitest/test_delete.py::TestDelete::testBasicSkipheadBothForms[False-2-] PASSED [ 14%]
02:21:16 test/integration/clitest/test_delete.py::TestDelete::testMultipleSkipheadsSameClass[True-1] PASSED [ 14%]
02:21:17 test/integration/clitest/test_delete.py::TestDelete::testMultipleSkipheadsSameClass[True-2] PASSED [ 14%]
02:21:17 test/integration/clitest/test_delete.py::TestDelete::testMultipleSkipheadsSameClass[True-3] PASSED [ 14%]
02:21:17 test/integration/clitest/test_delete.py::TestDelete::testMultipleSkipheadsSameClass[False-1] PASSED [ 14%]
02:21:17 test/integration/clitest/test_delete.py::TestDelete::testMultipleSkipheadsSameClass[False-2] PASSED [ 14%]
02:21:17 test/integration/clitest/test_delete.py::TestDelete::testMultipleSkipheadsSameClass[False-3] PASSED [ 14%]
02:21:18 test/integration/clitest/test_delete.py::TestDelete::testMultipleSkipheadsPlusObjectsSeparated[True-1] PASSED [ 14%]
02:21:18 test/integration/clitest/test_delete.py::TestDelete::testMultipleSkipheadsPlusObjectsSeparated[True-2] PASSED [ 14%]
02:21:19 test/integration/clitest/test_delete.py::TestDelete::testMultipleSkipheadsPlusObjectsSeparated[True-3] PASSED [ 14%]
02:21:19 test/integration/clitest/test_delete.py::TestDelete::testMultipleSkipheadsPlusObjectsSeparated[False-1] PASSED [ 14%]
02:21:19 test/integration/clitest/test_delete.py::TestDelete::testMultipleSkipheadsPlusObjectsSeparated[False-2] PASSED [ 14%]
02:21:19 test/integration/clitest/test_delete.py::TestDelete::testMultipleSkipheadsPlusObjectsSeparated[False-3] PASSED [ 14%]
02:21:19 test/integration/clitest/test_delete.py::TestDelete::testMultipleSkipheadsPlusObjectsInterlaced[True-1] PASSED [ 14%]
02:21:20 test/integration/clitest/test_delete.py::TestDelete::testMultipleSkipheadsPlusObjectsInterlaced[True-2] PASSED [ 14%]
02:21:20 test/integration/clitest/test_delete.py::TestDelete::testMultipleSkipheadsPlusObjectsInterlaced[True-3] PASSED [ 14%]
02:21:20 test/integration/clitest/test_delete.py::TestDelete::testMultipleSkipheadsPlusObjectsInterlaced[False-1] PASSED [ 14%]
02:21:20 test/integration/clitest/test_delete.py::TestDelete::testMultipleSkipheadsPlusObjectsInterlaced[False-2] PASSED [ 14%]
02:21:21 test/integration/clitest/test_delete.py::TestDelete::testMultipleSkipheadsPlusObjectsInterlaced[False-3] PASSED [ 14%]
02:21:21 test/integration/clitest/test_delete.py::TestDelete::testDryRun PASSED [ 14%]
02:21:21 test/integration/clitest/test_delete.py::TestDelete::testExcludeNone PASSED [ 15%]
02:21:21 test/integration/clitest/test_delete.py::TestDelete::testExcludeDataset PASSED [ 15%]
02:21:21 test/integration/clitest/test_delete.py::TestDelete::testExcludeImage PASSED [ 15%]
02:21:21 test/integration/clitest/test_delete.py::TestDelete::testExcludeOverridesInclude PASSED [ 15%]
02:21:21 test/integration/clitest/test_delete.py::TestDelete::testDefaultExclusion PASSED [ 15%]
02:21:22 test/integration/clitest/test_delete.py::TestDelete::testDefaultExclusionOverride PASSED [ 15%]
02:21:22 test/integration/clitest/test_delete.py::TestDelete::testDefaultExclusionPartialOverride PASSED [ 15%]
02:21:22 test/integration/clitest/test_delete.py::TestDelete::testSeparateAnnotationDelete PASSED [ 15%]
02:21:22 test/integration/clitest/test_delete.py::TestDelete::testLinkedAnnotationDelete PASSED [ 15%]
02:21:23 test/integration/clitest/test_delete.py::TestDelete::testLinkedAnnotationDeleteWithOverride PASSED [ 15%]
02:21:23 test/integration/clitest/test_delete.py::TestDelete::testInputWithElisionDefault[1] PASSED [ 15%]
02:21:23 test/integration/clitest/test_delete.py::TestDelete::testInputWithElisionDefault[2] PASSED [ 15%]
02:21:23 test/integration/clitest/test_delete.py::TestDelete::testInputWithElisionDefault[3] PASSED [ 15%]
02:21:23 test/integration/clitest/test_delete.py::TestDelete::testInputWithElisionForce PASSED [ 15%]
02:21:25 test/integration/clitest/test_delete.py::TestDelete::testElisionDefaultFailForce PASSED [ 15%]
02:21:51 test/integration/clitest/test_delete.py::TestDelete::testOutputWithElision PASSED [ 15%]
02:21:53 test/integration/clitest/test_delete.py::TestTagDelete::testDeleteOneTagSetNotTags PASSED [ 15%]
02:21:53 test/integration/clitest/test_delete.py::TestTagDelete::testDeleteTwoTagSetsNotTags PASSED [ 15%]
02:21:54 test/integration/clitest/test_delete.py::TestTagDelete::testDeleteOneTagSetIncludingTags PASSED [ 15%]
02:21:54 test/integration/clitest/test_delete.py::TestTagDelete::testDeleteTwoTagSetsIncludingTags PASSED [ 15%]
02:21:56 test/integration/clitest/test_download.py::TestDownload::testNonExistingOriginalFile[] PASSED [ 16%]
02:21:56 test/integration/clitest/test_download.py::TestDownload::testNonExistingOriginalFile[OriginalFile:] PASSED [ 16%]
02:21:56 test/integration/clitest/test_download.py::TestDownload::testOriginalFileTmpfile[] PASSED [ 16%]
02:21:56 test/integration/clitest/test_download.py::TestDownload::testOriginalFileTmpfile[OriginalFile:] PASSED [ 16%]
02:21:56 test/integration/clitest/test_download.py::TestDownload::testOriginalFileStdout[] PASSED [ 16%]
02:21:56 test/integration/clitest/test_download.py::TestDownload::testOriginalFileStdout[OriginalFile:] PASSED [ 16%]
02:21:58 test/integration/clitest/test_download.py::TestDownload::testOriginalFileMultipleGroups[] PASSED [ 16%]
02:22:00 test/integration/clitest/test_download.py::TestDownload::testOriginalFileMultipleGroups[OriginalFile:] PASSED [ 16%]
02:22:00 test/integration/clitest/test_download.py::TestDownload::testNonExistingFileAnnotation PASSED [ 16%]
02:22:00 test/integration/clitest/test_download.py::TestDownload::testFileAnnotationTmpfile PASSED [ 16%]
02:22:00 test/integration/clitest/test_download.py::TestDownload::testFileAnnotationStdout PASSED [ 16%]
02:22:02 test/integration/clitest/test_download.py::TestDownload::testFileAnnotationMultipleGroups PASSED [ 16%]
02:22:06 test/integration/clitest/test_download.py::TestDownload::testNonExistingImage PASSED [ 16%]
02:22:09 test/integration/clitest/test_download.py::TestDownload::testImageFileset[True] PASSED [ 16%]
02:22:12 test/integration/clitest/test_download.py::TestDownload::testImageFileset[False] PASSED [ 16%]
02:22:16 test/integration/clitest/test_download.py::TestDownload::testSingleImageWithCompanion PASSED [ 16%]
02:22:19 test/integration/clitest/test_download.py::TestDownload::testMIF PASSED [ 16%]
02:22:19 test/integration/clitest/test_download.py::TestDownload::testImageNoFileset PASSED [ 16%]
02:22:24 test/integration/clitest/test_download.py::TestDownload::testImageMultipleGroups PASSED [ 16%]
02:22:24 test/integration/clitest/test_download.py::TestDownload::testValidPolicy PASSED [ 16%]
02:22:37 test/integration/clitest/test_download.py::TestDownload::testPolicyGlobalRestriction[+read,+write,+image] PASSED [ 16%]
02:22:37 test/integration/clitest/test_download.py::TestDownload::testPolicyGlobalRestriction[-read,-write,-image,-plate] SKIPPED [ 17%]
02:22:37 test/integration/clitest/test_download.py::TestDownload::testPolicyGlobalRestriction[-read,+write,+image,-plate] SKIPPED [ 17%]
02:22:37 test/integration/clitest/test_download.py::TestDownload::testPolicyGlobalRestriction[+read,+write,+image,-plate] SKIPPED [ 17%]
02:22:37 test/integration/clitest/test_download.py::TestDownload::testPolicyGlobalRestriction[+read,+write,+image,+plate] SKIPPED [ 17%]
02:22:50 test/integration/clitest/test_download.py::TestDownload::testPolicyGroupRestriction[+read,+write,+image] PASSED [ 17%]
02:23:02 test/integration/clitest/test_download.py::TestDownload::testPolicyGroupRestriction[-read,-write,-image,-plate] PASSED [ 17%]
02:23:15 test/integration/clitest/test_download.py::TestDownload::testPolicyGroupRestriction[-read,+write,+image,-plate] PASSED [ 17%]
02:23:28 test/integration/clitest/test_download.py::TestDownload::testPolicyGroupRestriction[+read,+write,+image,-plate] PASSED [ 17%]
02:23:41 test/integration/clitest/test_download.py::TestDownload::testPolicyGroupRestriction[+read,+write,+image,+plate] PASSED [ 17%]
02:23:43 test/integration/clitest/test_duplicate.py::TestDuplicate::testDuplicateSingleObject[Image-] PASSED [ 17%]
02:23:43 test/integration/clitest/test_duplicate.py::TestDuplicate::testDuplicateSingleObject[Image-I] PASSED [ 17%]
02:23:43 test/integration/clitest/test_duplicate.py::TestDuplicate::testDuplicateSingleObject[Dataset-] PASSED [ 17%]
02:23:43 test/integration/clitest/test_duplicate.py::TestDuplicate::testDuplicateSingleObject[Dataset-I] PASSED [ 17%]
02:23:43 test/integration/clitest/test_duplicate.py::TestDuplicate::testDuplicateSingleObject[Project-] PASSED [ 17%]
02:23:43 test/integration/clitest/test_duplicate.py::TestDuplicate::testDuplicateSingleObject[Project-I] PASSED [ 17%]
02:23:43 test/integration/clitest/test_duplicate.py::TestDuplicate::testDuplicateSingleObject[Plate-] PASSED [ 17%]
02:23:43 test/integration/clitest/test_duplicate.py::TestDuplicate::testDuplicateSingleObject[Plate-I] PASSED [ 17%]
02:23:43 test/integration/clitest/test_duplicate.py::TestDuplicate::testDuplicateSingleObject[Screen-] PASSED [ 17%]
02:23:43 test/integration/clitest/test_duplicate.py::TestDuplicate::testDuplicateSingleObject[Screen-I] PASSED [ 17%]
02:23:44 test/integration/clitest/test_duplicate.py::TestDuplicate::testDuplicateSingleObjectDryRun PASSED [ 17%]
02:23:44 test/integration/clitest/test_duplicate.py::TestDuplicate::testDuplicateSingleObjectReport PASSED [ 18%]
02:23:44 test/integration/clitest/test_duplicate.py::TestDuplicate::testDuplicateSingleObjectDryRunReport PASSED [ 18%]
02:23:44 test/integration/clitest/test_duplicate.py::TestDuplicate::testBasicHierarchyDuplication PASSED [ 18%]
02:23:44 test/integration/clitest/test_duplicate.py::TestDuplicate::testIgnoreLinks PASSED [ 18%]
02:23:44 test/integration/clitest/test_duplicate.py::TestDuplicate::testIgnoreLinksOverridden PASSED [ 18%]
02:23:44 test/integration/clitest/test_duplicate.py::TestDuplicate::testReferencing PASSED [ 18%]
02:23:44 test/integration/clitest/test_duplicate.py::TestDuplicate::testSkipheadDuplication PASSED [ 18%]
02:23:46 test/integration/clitest/test_fs.py::TestFS::testRepos PASSED [ 18%]
02:24:06 test/integration/clitest/test_fs.py::TestFS::testSetsWithTransfer PASSED [ 18%]
02:24:06 test/integration/clitest/test_fs.py::TestFS::testSetsAdminOnly PASSED [ 18%]
02:24:06 test/integration/clitest/test_fs.py::TestFS::testMkdirAdminOnly PASSED [ 18%]
02:24:11 test/integration/clitest/test_fs.py::TestFS::testImportTime[all-True] PASSED [ 18%]
02:24:14 test/integration/clitest/test_fs.py::TestFS::testImportTime[all-False] PASSED [ 18%]
02:24:19 test/integration/clitest/test_fs.py::TestFS::testImportTime[minmax-True] PASSED [ 18%]
02:24:22 test/integration/clitest/test_fs.py::TestFS::testImportTime[minmax-False] PASSED [ 18%]
02:24:27 test/integration/clitest/test_fs.py::TestFS::testImportTime[thumbnails-True] PASSED [ 18%]
02:24:30 test/integration/clitest/test_fs.py::TestFS::testImportTime[thumbnails-False] PASSED [ 18%]
02:24:32 test/integration/clitest/test_fs.py::TestFsRoot::testMkdirAsAdminSimpleDirCreation PASSED [ 18%]
02:24:32 test/integration/clitest/test_fs.py::TestFsRoot::testMkdirAsAdminHierarchyOnlyPreexisting PASSED [ 18%]
02:24:32 test/integration/clitest/test_fs.py::TestFsRoot::testMkdirAsAdminHierarchyParents PASSED [ 18%]
02:24:41 test/integration/clitest/test_group.py::TestGroup::testList[None-None] PASSED [ 19%]
02:24:44 test/integration/clitest/test_group.py::TestGroup::testList[None-id] PASSED [ 19%]
02:24:48 test/integration/clitest/test_group.py::TestGroup::testList[None-name] PASSED [ 19%]
02:24:51 test/integration/clitest/test_group.py::TestGroup::testList[count-None] PASSED [ 19%]
02:24:54 test/integration/clitest/test_group.py::TestGroup::testList[count-id] PASSED [ 19%]
02:24:58 test/integration/clitest/test_group.py::TestGroup::testList[count-name] PASSED [ 19%]
02:25:01 test/integration/clitest/test_group.py::TestGroup::testList[long-None] PASSED [ 19%]
02:25:05 test/integration/clitest/test_group.py::TestGroup::testList[long-id] PASSED [ 19%]
02:25:09 test/integration/clitest/test_group.py::TestGroup::testList[long-name] PASSED [ 19%]
02:25:09 test/integration/clitest/test_group.py::TestGroup::testAddAdminOnly PASSED [ 19%]
02:25:09 test/integration/clitest/test_group.py::TestGroup::testInfoNoArgument PASSED [ 19%]
02:25:09 test/integration/clitest/test_group.py::TestGroup::testInfoArgument[id] PASSED [ 19%]
02:25:09 test/integration/clitest/test_group.py::TestGroup::testInfoArgument[name] PASSED [ 19%]
02:25:09 test/integration/clitest/test_group.py::TestGroup::testInfoArgument[--group-id] PASSED [ 19%]
02:25:09 test/integration/clitest/test_group.py::TestGroup::testInfoArgument[--group-name] PASSED [ 19%]
02:25:09 test/integration/clitest/test_group.py::TestGroup::testInfoInvalidGroup PASSED [ 19%]
02:25:09 test/integration/clitest/test_group.py::TestGroup::testListUsersNoArgument PASSED [ 19%]
02:25:09 test/integration/clitest/test_group.py::TestGroup::testListUsersArgument[id] PASSED [ 19%]
02:25:09 test/integration/clitest/test_group.py::TestGroup::testListUsersArgument[name] PASSED [ 19%]
02:25:09 test/integration/clitest/test_group.py::TestGroup::testListUsersArgument[--group-id] PASSED [ 19%]
02:25:09 test/integration/clitest/test_group.py::TestGroup::testListUsersArgument[--group-name] PASSED [ 20%]
02:25:09 test/integration/clitest/test_group.py::TestGroup::testListUsersInvalidArgument PASSED [ 20%]
02:25:11 test/integration/clitest/test_group.py::TestGroupRoot::testAddDefaults PASSED [ 20%]
02:25:11 test/integration/clitest/test_group.py::TestGroupRoot::testAddPerms[--perms-rw----] PASSED [ 20%]
02:25:11 test/integration/clitest/test_group.py::TestGroupRoot::testAddPerms[--perms-rwr---] PASSED [ 20%]
02:25:11 test/integration/clitest/test_group.py::TestGroupRoot::testAddPerms[--perms-rwra--] PASSED [ 20%]
02:25:11 test/integration/clitest/test_group.py::TestGroupRoot::testAddPerms[--perms-rwrw--] PASSED [ 20%]
02:25:11 test/integration/clitest/test_group.py::TestGroupRoot::testAddPerms[--type-private] PASSED [ 20%]
02:25:11 test/integration/clitest/test_group.py::TestGroupRoot::testAddPerms[--type-read-only] PASSED [ 20%]
02:25:11 test/integration/clitest/test_group.py::TestGroupRoot::testAddPerms[--type-read-annotate] PASSED [ 20%]
02:25:11 test/integration/clitest/test_group.py::TestGroupRoot::testAddPerms[--type-read-write] PASSED [ 20%]
02:25:11 test/integration/clitest/test_group.py::TestGroupRoot::testAddSameNamefails PASSED [ 20%]
02:25:12 test/integration/clitest/test_group.py::TestGroupRoot::testAddIgnoreExisting PASSED [ 20%]
02:25:12 test/integration/clitest/test_group.py::TestGroupRoot::testPerms[--perms-rw-----rw-------id] PASSED [ 20%]
02:25:12 test/integration/clitest/test_group.py::TestGroupRoot::testPerms[--perms-rw-----rw-------name] PASSED [ 20%]
02:25:13 test/integration/clitest/test_group.py::TestGroupRoot::testPerms[--perms-rw-----rwr------id] PASSED [ 20%]
02:25:14 test/integration/clitest/test_group.py::TestGroupRoot::testPerms[--perms-rw-----rwr------name] PASSED [ 20%]
02:25:14 test/integration/clitest/test_group.py::TestGroupRoot::testPerms[--perms-rw-----rwra-----id] PASSED [ 20%]
02:25:15 test/integration/clitest/test_group.py::TestGroupRoot::testPerms[--perms-rw-----rwra-----name] PASSED [ 20%]
02:25:16 test/integration/clitest/test_group.py::TestGroupRoot::testPerms[--perms-rw-----rwrw-----id] PASSED [ 20%]
02:25:17 test/integration/clitest/test_group.py::TestGroupRoot::testPerms[--perms-rw-----rwrw-----name] PASSED [ 20%]
02:25:17 test/integration/clitest/test_group.py::TestGroupRoot::testPerms[--perms-rwr----rw-------id] PASSED [ 21%]
02:25:17 test/integration/clitest/test_group.py::TestGroupRoot::testPerms[--perms-rwr----rw-------name] PASSED [ 21%]
02:25:17 test/integration/clitest/test_group.py::TestGroupRoot::testPerms[--perms-rwr----rwr------id] PASSED [ 21%]
02:25:17 test/integration/clitest/test_group.py::TestGroupRoot::testPerms[--perms-rwr----rwr------name] PASSED [ 21%]
02:25:18 test/integration/clitest/test_group.py::TestGroupRoot::testPerms[--perms-rwr----rwra-----id] PASSED [ 21%]
02:25:18 test/integration/clitest/test_group.py::TestGroupRoot::testPerms[--perms-rwr----rwra-----name] PASSED [ 21%]
02:25:18 test/integration/clitest/test_group.py::TestGroupRoot::testPerms[--perms-rwr----rwrw-----id] PASSED [ 21%]
02:25:18 test/integration/clitest/test_group.py::TestGroupRoot::testPerms[--perms-rwr----rwrw-----name] PASSED [ 21%]
02:25:19 test/integration/clitest/test_group.py::TestGroupRoot::testPerms[--perms-rwra---rw-------id] PASSED [ 21%]
02:25:19 test/integration/clitest/test_group.py::TestGroupRoot::testPerms[--perms-rwra---rw-------name] PASSED [ 21%]
02:25:19 test/integration/clitest/test_group.py::TestGroupRoot::testPerms[--perms-rwra---rwr------id] PASSED [ 21%]
02:25:19 test/integration/clitest/test_group.py::TestGroupRoot::testPerms[--perms-rwra---rwr------name] PASSED [ 21%]
02:25:19 test/integration/clitest/test_group.py::TestGroupRoot::testPerms[--perms-rwra---rwra-----id] PASSED [ 21%]
02:25:19 test/integration/clitest/test_group.py::TestGroupRoot::testPerms[--perms-rwra---rwra-----name] PASSED [ 21%]
02:25:19 test/integration/clitest/test_group.py::TestGroupRoot::testPerms[--perms-rwra---rwrw-----id] PASSED [ 21%]
02:25:20 test/integration/clitest/test_group.py::TestGroupRoot::testPerms[--perms-rwra---rwrw-----name] PASSED [ 21%]
02:25:20 test/integration/clitest/test_group.py::TestGroupRoot::testPerms[--perms-rwrw---rw-------id] PASSED [ 21%]
02:25:20 test/integration/clitest/test_group.py::TestGroupRoot::testPerms[--perms-rwrw---rw-------name] PASSED [ 21%]
02:25:20 test/integration/clitest/test_group.py::TestGroupRoot::testPerms[--perms-rwrw---rwr------id] PASSED [ 21%]
02:25:21 test/integration/clitest/test_group.py::TestGroupRoot::testPerms[--perms-rwrw---rwr------name] PASSED [ 21%]
02:25:21 test/integration/clitest/test_group.py::TestGroupRoot::testPerms[--perms-rwrw---rwra-----id] PASSED [ 22%]
02:25:21 test/integration/clitest/test_group.py::TestGroupRoot::testPerms[--perms-rwrw---rwra-----name] PASSED [ 22%]
02:25:21 test/integration/clitest/test_group.py::TestGroupRoot::testPerms[--perms-rwrw---rwrw-----id] PASSED [ 22%]
02:25:21 test/integration/clitest/test_group.py::TestGroupRoot::testPerms[--perms-rwrw---rwrw-----name] PASSED [ 22%]
02:25:21 test/integration/clitest/test_group.py::TestGroupRoot::testPerms[--type-private-rw-------id] PASSED [ 22%]
02:25:21 test/integration/clitest/test_group.py::TestGroupRoot::testPerms[--type-private-rw-------name] PASSED [ 22%]
02:25:22 test/integration/clitest/test_group.py::TestGroupRoot::testPerms[--type-private-rwr------id] PASSED [ 22%]
02:25:23 test/integration/clitest/test_group.py::TestGroupRoot::testPerms[--type-private-rwr------name] PASSED [ 22%]
02:25:24 test/integration/clitest/test_group.py::TestGroupRoot::testPerms[--type-private-rwra-----id] PASSED [ 22%]
02:25:25 test/integration/clitest/test_group.py::TestGroupRoot::testPerms[--type-private-rwra-----name] PASSED [ 22%]
02:25:26 test/integration/clitest/test_group.py::TestGroupRoot::testPerms[--type-private-rwrw-----id] PASSED [ 22%]
02:25:26 test/integration/clitest/test_group.py::TestGroupRoot::testPerms[--type-private-rwrw-----name] PASSED [ 22%]
02:25:27 test/integration/clitest/test_group.py::TestGroupRoot::testPerms[--type-read-only-rw-------id] PASSED [ 22%]
02:25:27 test/integration/clitest/test_group.py::TestGroupRoot::testPerms[--type-read-only-rw-------name] PASSED [ 22%]
02:25:27 test/integration/clitest/test_group.py::TestGroupRoot::testPerms[--type-read-only-rwr------id] PASSED [ 22%]
02:25:27 test/integration/clitest/test_group.py::TestGroupRoot::testPerms[--type-read-only-rwr------name] PASSED [ 22%]
02:25:27 test/integration/clitest/test_group.py::TestGroupRoot::testPerms[--type-read-only-rwra-----id] PASSED [ 22%]
02:25:27 test/integration/clitest/test_group.py::TestGroupRoot::testPerms[--type-read-only-rwra-----name] PASSED [ 22%]
02:25:28 test/integration/clitest/test_group.py::TestGroupRoot::testPerms[--type-read-only-rwrw-----id] PASSED [ 22%]
02:25:28 test/integration/clitest/test_group.py::TestGroupRoot::testPerms[--type-read-only-rwrw-----name] PASSED [ 22%]
02:25:28 test/integration/clitest/test_group.py::TestGroupRoot::testPerms[--type-read-annotate-rw-------id] PASSED [ 23%]
02:25:28 test/integration/clitest/test_group.py::TestGroupRoot::testPerms[--type-read-annotate-rw-------name] PASSED [ 23%]
02:25:28 test/integration/clitest/test_group.py::TestGroupRoot::testPerms[--type-read-annotate-rwr------id] PASSED [ 23%]
02:25:29 test/integration/clitest/test_group.py::TestGroupRoot::testPerms[--type-read-annotate-rwr------name] PASSED [ 23%]
02:25:29 test/integration/clitest/test_group.py::TestGroupRoot::testPerms[--type-read-annotate-rwra-----id] PASSED [ 23%]
02:25:29 test/integration/clitest/test_group.py::TestGroupRoot::testPerms[--type-read-annotate-rwra-----name] PASSED [ 23%]
02:25:29 test/integration/clitest/test_group.py::TestGroupRoot::testPerms[--type-read-annotate-rwrw-----id] PASSED [ 23%]
02:25:29 test/integration/clitest/test_group.py::TestGroupRoot::testPerms[--type-read-annotate-rwrw-----name] PASSED [ 23%]
02:25:29 test/integration/clitest/test_group.py::TestGroupRoot::testPerms[--type-read-write-rw-------id] PASSED [ 23%]
02:25:29 test/integration/clitest/test_group.py::TestGroupRoot::testPerms[--type-read-write-rw-------name] PASSED [ 23%]
02:25:30 test/integration/clitest/test_group.py::TestGroupRoot::testPerms[--type-read-write-rwr------id] PASSED [ 23%]
02:25:30 test/integration/clitest/test_group.py::TestGroupRoot::testPerms[--type-read-write-rwr------name] PASSED [ 23%]
02:25:30 test/integration/clitest/test_group.py::TestGroupRoot::testPerms[--type-read-write-rwra-----id] PASSED [ 23%]
02:25:30 test/integration/clitest/test_group.py::TestGroupRoot::testPerms[--type-read-write-rwra-----name] PASSED [ 23%]
02:25:30 test/integration/clitest/test_group.py::TestGroupRoot::testPerms[--type-read-write-rwrw-----id] PASSED [ 23%]
02:25:30 test/integration/clitest/test_group.py::TestGroupRoot::testPerms[--type-read-write-rwrw-----name] PASSED [ 23%]
02:25:32 test/integration/clitest/test_group.py::TestGroupRoot::testAddUser[None-id---id] PASSED [ 23%]
02:25:34 test/integration/clitest/test_group.py::TestGroupRoot::testAddUser[None-id---name] PASSED [ 23%]
02:25:36 test/integration/clitest/test_group.py::TestGroupRoot::testAddUser[None-omeName---id] PASSED [ 23%]
02:25:37 test/integration/clitest/test_group.py::TestGroupRoot::testAddUser[None-omeName---name] PASSED [ 23%]
02:25:39 test/integration/clitest/test_group.py::TestGroupRoot::testAddUser[None---user-id---id] PASSED [ 24%]
02:25:41 test/integration/clitest/test_group.py::TestGroupRoot::testAddUser[None---user-id---name] PASSED [ 24%]
02:25:43 test/integration/clitest/test_group.py::TestGroupRoot::testAddUser[None---user-name---id] PASSED [ 24%]
02:25:45 test/integration/clitest/test_group.py::TestGroupRoot::testAddUser[None---user-name---name] PASSED [ 24%]
02:25:47 test/integration/clitest/test_group.py::TestGroupRoot::testAddUser[--as-owner-id---id] PASSED [ 24%]
02:25:49 test/integration/clitest/test_group.py::TestGroupRoot::testAddUser[--as-owner-id---name] PASSED [ 24%]
02:25:51 test/integration/clitest/test_group.py::TestGroupRoot::testAddUser[--as-owner-omeName---id] PASSED [ 24%]
02:25:53 test/integration/clitest/test_group.py::TestGroupRoot::testAddUser[--as-owner-omeName---name] PASSED [ 24%]
02:25:54 test/integration/clitest/test_group.py::TestGroupRoot::testAddUser[--as-owner---user-id---id] PASSED [ 24%]
02:25:56 test/integration/clitest/test_group.py::TestGroupRoot::testAddUser[--as-owner---user-id---name] PASSED [ 24%]
02:25:58 test/integration/clitest/test_group.py::TestGroupRoot::testAddUser[--as-owner---user-name---id] PASSED [ 24%]
02:26:00 test/integration/clitest/test_group.py::TestGroupRoot::testAddUser[--as-owner---user-name---name] PASSED [ 24%]
02:26:02 test/integration/clitest/test_group.py::TestGroupRoot::testRemoveUser[None-True-id---id] PASSED [ 24%]
02:26:04 test/integration/clitest/test_group.py::TestGroupRoot::testRemoveUser[None-True-id---name] PASSED [ 24%]
02:26:06 test/integration/clitest/test_group.py::TestGroupRoot::testRemoveUser[None-True-omeName---id] PASSED [ 24%]
02:26:08 test/integration/clitest/test_group.py::TestGroupRoot::testRemoveUser[None-True-omeName---name] PASSED [ 24%]
02:26:09 test/integration/clitest/test_group.py::TestGroupRoot::testRemoveUser[None-True---user-id---id] PASSED [ 24%]
02:26:11 test/integration/clitest/test_group.py::TestGroupRoot::testRemoveUser[None-True---user-id---name] PASSED [ 24%]
02:26:13 test/integration/clitest/test_group.py::TestGroupRoot::testRemoveUser[None-True---user-name---id] PASSED [ 24%]
02:26:15 test/integration/clitest/test_group.py::TestGroupRoot::testRemoveUser[None-True---user-name---name] PASSED [ 24%]
02:26:17 test/integration/clitest/test_group.py::TestGroupRoot::testRemoveUser[None-False-id---id] PASSED [ 24%]
02:26:19 test/integration/clitest/test_group.py::TestGroupRoot::testRemoveUser[None-False-id---name] PASSED [ 25%]
02:26:21 test/integration/clitest/test_group.py::TestGroupRoot::testRemoveUser[None-False-omeName---id] PASSED [ 25%]
02:26:23 test/integration/clitest/test_group.py::TestGroupRoot::testRemoveUser[None-False-omeName---name] PASSED [ 25%]
02:26:24 test/integration/clitest/test_group.py::TestGroupRoot::testRemoveUser[None-False---user-id---id] PASSED [ 25%]
02:26:27 test/integration/clitest/test_group.py::TestGroupRoot::testRemoveUser[None-False---user-id---name] PASSED [ 25%]
02:26:28 test/integration/clitest/test_group.py::TestGroupRoot::testRemoveUser[None-False---user-name---id] PASSED [ 25%]
02:26:30 test/integration/clitest/test_group.py::TestGroupRoot::testRemoveUser[None-False---user-name---name] PASSED [ 25%]
02:26:32 test/integration/clitest/test_group.py::TestGroupRoot::testRemoveUser[--as-owner-True-id---id] PASSED [ 25%]
02:26:34 test/integration/clitest/test_group.py::TestGroupRoot::testRemoveUser[--as-owner-True-id---name] PASSED [ 25%]
02:26:36 test/integration/clitest/test_group.py::TestGroupRoot::testRemoveUser[--as-owner-True-omeName---id] PASSED [ 25%]
02:26:38 test/integration/clitest/test_group.py::TestGroupRoot::testRemoveUser[--as-owner-True-omeName---name] PASSED [ 25%]
02:26:40 test/integration/clitest/test_group.py::TestGroupRoot::testRemoveUser[--as-owner-True---user-id---id] PASSED [ 25%]
02:26:42 test/integration/clitest/test_group.py::TestGroupRoot::testRemoveUser[--as-owner-True---user-id---name] PASSED [ 25%]
02:26:44 test/integration/clitest/test_group.py::TestGroupRoot::testRemoveUser[--as-owner-True---user-name---id] PASSED [ 25%]
02:26:46 test/integration/clitest/test_group.py::TestGroupRoot::testRemoveUser[--as-owner-True---user-name---name] PASSED [ 25%]
02:26:48 test/integration/clitest/test_group.py::TestGroupRoot::testRemoveUser[--as-owner-False-id---id] PASSED [ 25%]
02:26:50 test/integration/clitest/test_group.py::TestGroupRoot::testRemoveUser[--as-owner-False-id---name] PASSED [ 25%]
02:26:51 test/integration/clitest/test_group.py::TestGroupRoot::testRemoveUser[--as-owner-False-omeName---id] PASSED [ 25%]
02:26:53 test/integration/clitest/test_group.py::TestGroupRoot::testRemoveUser[--as-owner-False-omeName---name] PASSED [ 25%]
02:26:55 test/integration/clitest/test_group.py::TestGroupRoot::testRemoveUser[--as-owner-False---user-id---id] PASSED [ 25%]
02:26:57 test/integration/clitest/test_group.py::TestGroupRoot::testRemoveUser[--as-owner-False---user-id---name] PASSED [ 26%]
02:26:59 test/integration/clitest/test_group.py::TestGroupRoot::testRemoveUser[--as-owner-False---user-name---id] PASSED [ 26%]
02:27:01 test/integration/clitest/test_group.py::TestGroupRoot::testRemoveUser[--as-owner-False---user-name---name] PASSED [ 26%]
02:27:08 test/integration/clitest/test_group.py::TestGroupRoot::testCopyUsers[None-id-id] PASSED [ 26%]
02:27:16 test/integration/clitest/test_group.py::TestGroupRoot::testCopyUsers[None-id-name] PASSED [ 26%]
02:27:24 test/integration/clitest/test_group.py::TestGroupRoot::testCopyUsers[None-name-id] PASSED [ 26%]
02:27:31 test/integration/clitest/test_group.py::TestGroupRoot::testCopyUsers[None-name-name] PASSED [ 26%]
02:27:39 test/integration/clitest/test_group.py::TestGroupRoot::testCopyUsers[--as-owner-id-id] PASSED [ 26%]
02:27:46 test/integration/clitest/test_group.py::TestGroupRoot::testCopyUsers[--as-owner-id-name] PASSED [ 26%]
02:27:53 test/integration/clitest/test_group.py::TestGroupRoot::testCopyUsers[--as-owner-name-id] PASSED [ 26%]
02:28:01 test/integration/clitest/test_group.py::TestGroupRoot::testCopyUsers[--as-owner-name-name] PASSED [ 26%]
02:28:05 test/integration/clitest/test_import.py::TestImport::testAutoClose PASSED [ 26%]
02:28:08 test/integration/clitest/test_import.py::TestImport::testChecksumAlgorithm[Adler-32-legacy] PASSED [ 26%]
02:28:11 test/integration/clitest/test_import.py::TestImport::testChecksumAlgorithm[Adler-32-underscore] PASSED [ 26%]
02:28:14 test/integration/clitest/test_import.py::TestImport::testChecksumAlgorithm[CRC-32-underscore] PASSED [ 26%]
02:28:17 test/integration/clitest/test_import.py::TestImport::testChecksumAlgorithm[File-Size-64-underscore] PASSED [ 26%]
02:28:20 test/integration/clitest/test_import.py::TestImport::testChecksumAlgorithm[MD5-128-underscore] PASSED [ 26%]
02:28:22 test/integration/clitest/test_import.py::TestImport::testChecksumAlgorithm[Murmur3-32-underscore] PASSED [ 26%]
02:28:25 test/integration/clitest/test_import.py::TestImport::testChecksumAlgorithm[Murmur3-128-underscore] PASSED [ 26%]
02:28:28 test/integration/clitest/test_import.py::TestImport::testChecksumAlgorithm[SHA1-160-underscore] PASSED [ 26%]
02:28:30 test/integration/clitest/test_import.py::TestImport::testAnnotationText[Python-1-Official-True] PASSED [ 27%]
02:28:33 test/integration/clitest/test_import.py::TestImport::testAnnotationText[Python-1-Official-False] PASSED [ 27%]
02:28:35 test/integration/clitest/test_import.py::TestImport::testAnnotationText[Python-1-Deprecated-True] PASSED [ 27%]
02:28:37 test/integration/clitest/test_import.py::TestImport::testAnnotationText[Python-1-Deprecated-False] PASSED [ 27%]
02:28:41 test/integration/clitest/test_import.py::TestImport::testAnnotationText[Java-1-Official-True] PASSED [ 27%]
02:28:44 test/integration/clitest/test_import.py::TestImport::testAnnotationText[Java-1-Official-False] PASSED [ 27%]
02:28:46 test/integration/clitest/test_import.py::TestImport::testAnnotationText[Java-1-Deprecated-True] PASSED [ 27%]
02:28:48 test/integration/clitest/test_import.py::TestImport::testAnnotationText[Java-1-Deprecated-False] PASSED [ 27%]
02:28:51 test/integration/clitest/test_import.py::TestImport::testAnnotationText[Java-2-Official-True] PASSED [ 27%]
02:28:54 test/integration/clitest/test_import.py::TestImport::testAnnotationText[Java-2-Official-False] PASSED [ 27%]
02:28:56 test/integration/clitest/test_import.py::TestImport::testAnnotationText[Java-2-Deprecated-True] PASSED [ 27%]
02:28:59 test/integration/clitest/test_import.py::TestImport::testAnnotationText[Java-2-Deprecated-False] PASSED [ 27%]
02:29:01 test/integration/clitest/test_import.py::TestImport::testAnnotationText_one_ns[Python-1-Official] PASSED [ 27%]
02:29:03 test/integration/clitest/test_import.py::TestImport::testAnnotationText_one_ns[Python-1-Deprecated] PASSED [ 27%]
02:29:06 test/integration/clitest/test_import.py::TestImport::testAnnotationText_one_ns[Java-1-Official] PASSED [ 27%]
02:29:08 test/integration/clitest/test_import.py::TestImport::testAnnotationText_one_ns[Java-1-Deprecated] PASSED [ 27%]
02:29:11 test/integration/clitest/test_import.py::TestImport::testAnnotationText_one_ns[Java-2-Official] PASSED [ 27%]
02:29:13 test/integration/clitest/test_import.py::TestImport::testAnnotationText_one_ns[Java-2-Deprecated] PASSED [ 27%]
02:29:15 test/integration/clitest/test_import.py::TestImport::testAnnotationLink[Python-1-Official] PASSED [ 27%]
02:29:18 test/integration/clitest/test_import.py::TestImport::testAnnotationLink[Python-1-Deprecated] PASSED [ 27%]
02:29:21 test/integration/clitest/test_import.py::TestImport::testAnnotationLink[Java-1-Official] PASSED [ 28%]
02:29:24 test/integration/clitest/test_import.py::TestImport::testAnnotationLink[Java-1-Deprecated] PASSED [ 28%]
02:29:27 test/integration/clitest/test_import.py::TestImport::testAnnotationLink[Java-2-Official] PASSED [ 28%]
02:29:29 test/integration/clitest/test_import.py::TestImport::testAnnotationLink[Java-2-Deprecated] PASSED [ 28%]
02:29:36 test/integration/clitest/test_import.py::TestImport::testTargetArgument[source0-True] PASSED [ 28%]
02:29:41 test/integration/clitest/test_import.py::TestImport::testTargetArgument[source0-False] PASSED [ 28%]
02:29:50 test/integration/clitest/test_import.py::TestImport::testTargetArgument[source1-True] PASSED [ 28%]
02:29:57 test/integration/clitest/test_import.py::TestImport::testTargetArgument[source1-False] PASSED [ 28%]
02:30:03 test/integration/clitest/test_import.py::TestImport::testTargetArgument[source2-True] PASSED [ 28%]
02:30:08 test/integration/clitest/test_import.py::TestImport::testTargetArgument[source2-False] PASSED [ 28%]
02:30:15 test/integration/clitest/test_import.py::TestImport::testTargetArgument[source3-True] PASSED [ 28%]
02:30:20 test/integration/clitest/test_import.py::TestImport::testTargetArgument[source3-False] PASSED [ 28%]
02:30:28 test/integration/clitest/test_import.py::TestImport::testTargetArgument[source4-True] PASSED [ 28%]
02:30:34 test/integration/clitest/test_import.py::TestImport::testTargetArgument[source4-False] PASSED [ 28%]
02:30:41 test/integration/clitest/test_import.py::TestImport::testTargetArgument[source5-True] PASSED [ 28%]
02:30:45 test/integration/clitest/test_import.py::TestImport::testTargetArgument[source5-False] PASSED [ 28%]
02:30:53 test/integration/clitest/test_import.py::TestImport::testQualifiedNameModelTargetArgument[-True] PASSED [ 28%]
02:30:58 test/integration/clitest/test_import.py::TestImport::testQualifiedNameModelTargetArgument[-False] PASSED [ 28%]
02:31:05 test/integration/clitest/test_import.py::TestImport::testQualifiedNameModelTargetArgument[+-True] PASSED [ 28%]
02:31:10 test/integration/clitest/test_import.py::TestImport::testQualifiedNameModelTargetArgument[+-False] PASSED [ 28%]
02:31:17 test/integration/clitest/test_import.py::TestImport::testQualifiedNameModelTargetArgument[--True] PASSED [ 28%]
02:31:22 test/integration/clitest/test_import.py::TestImport::testQualifiedNameModelTargetArgument[--False] PASSED [ 29%]
02:31:29 test/integration/clitest/test_import.py::TestImport::testQualifiedNameModelTargetArgument[%-True] PASSED [ 29%]
02:31:34 test/integration/clitest/test_import.py::TestImport::testQualifiedNameModelTargetArgument[%-False] PASSED [ 29%]
02:31:41 test/integration/clitest/test_import.py::TestImport::testQualifiedNameModelTargetArgument[@-True] PASSED [ 29%]
02:31:47 test/integration/clitest/test_import.py::TestImport::testQualifiedNameModelTargetArgument[@-False] PASSED [ 29%]
02:31:54 test/integration/clitest/test_import.py::TestImport::testQualifiedNameTemplateTargetArgument[-True] PASSED [ 29%]
02:31:59 test/integration/clitest/test_import.py::TestImport::testQualifiedNameTemplateTargetArgument[-False] PASSED [ 29%]
02:32:07 test/integration/clitest/test_import.py::TestImport::testQualifiedNameTemplateTargetArgument[+-True] PASSED [ 29%]
02:32:12 test/integration/clitest/test_import.py::TestImport::testQualifiedNameTemplateTargetArgument[+-False] PASSED [ 29%]
02:32:18 test/integration/clitest/test_import.py::TestImport::testQualifiedNameTemplateTargetArgument[--True] PASSED [ 29%]
02:32:23 test/integration/clitest/test_import.py::TestImport::testQualifiedNameTemplateTargetArgument[--False] PASSED [ 29%]
02:32:29 test/integration/clitest/test_import.py::TestImport::testQualifiedNameTemplateTargetArgument[%-True] PASSED [ 29%]
02:32:34 test/integration/clitest/test_import.py::TestImport::testQualifiedNameTemplateTargetArgument[%-False] PASSED [ 29%]
02:32:39 test/integration/clitest/test_import.py::TestImport::testQualifiedNameTemplateTargetArgument[@-True] PASSED [ 29%]
02:32:44 test/integration/clitest/test_import.py::TestImport::testQualifiedNameTemplateTargetArgument[@-False] PASSED [ 29%]
02:32:48 test/integration/clitest/test_import.py::TestImport::testMultipleNameModelTargets[-True] PASSED [ 29%]
02:32:51 test/integration/clitest/test_import.py::TestImport::testMultipleNameModelTargets[-False] PASSED [ 29%]
02:32:54 test/integration/clitest/test_import.py::TestImport::testMultipleNameModelTargets[+-True] PASSED [ 29%]
02:32:57 test/integration/clitest/test_import.py::TestImport::testMultipleNameModelTargets[+-False] PASSED [ 29%]
02:33:00 test/integration/clitest/test_import.py::TestImport::testMultipleNameModelTargets[--True] PASSED [ 29%]
02:33:03 test/integration/clitest/test_import.py::TestImport::testMultipleNameModelTargets[--False] PASSED [ 30%]
02:33:05 test/integration/clitest/test_import.py::TestImport::testUniqueMultipleNameModelTargets[True] PASSED [ 30%]
02:33:07 test/integration/clitest/test_import.py::TestImport::testUniqueMultipleNameModelTargets[False] PASSED [ 30%]
02:33:10 test/integration/clitest/test_import.py::TestImport::testNestedNameTemplateTargetArgument[True] PASSED [ 30%]
02:33:13 test/integration/clitest/test_import.py::TestImport::testNestedNameTemplateTargetArgument[False] PASSED [ 30%]
02:33:18 test/integration/clitest/test_import.py::TestImport::testMultipleNameTemplateTargetArgument[-True] PASSED [ 30%]
02:33:20 test/integration/clitest/test_import.py::TestImport::testMultipleNameTemplateTargetArgument[-False] PASSED [ 30%]
02:33:24 test/integration/clitest/test_import.py::TestImport::testMultipleNameTemplateTargetArgument[+-True] PASSED [ 30%]
02:33:27 test/integration/clitest/test_import.py::TestImport::testMultipleNameTemplateTargetArgument[+-False] PASSED [ 30%]
02:33:30 test/integration/clitest/test_import.py::TestImport::testMultipleNameTemplateTargetArgument[--True] PASSED [ 30%]
02:33:33 test/integration/clitest/test_import.py::TestImport::testMultipleNameTemplateTargetArgument[--False] PASSED [ 30%]
02:33:36 test/integration/clitest/test_import.py::TestImport::testMultipleNameTemplateTargetArgument[@-True] PASSED [ 30%]
02:33:38 test/integration/clitest/test_import.py::TestImport::testMultipleNameTemplateTargetArgument[@-False] PASSED [ 30%]
02:33:42 test/integration/clitest/test_import.py::TestImport::testUniqueMultipleNameTemplateTargetArgument[True] PASSED [ 30%]
02:33:45 test/integration/clitest/test_import.py::TestImport::testUniqueMultipleNameTemplateTargetArgument[False] PASSED [ 30%]
02:33:52 test/integration/clitest/test_import.py::TestImport::testImportLinkableTarget[False-False] PASSED [ 30%]
02:33:58 test/integration/clitest/test_import.py::TestImport::testImportLinkableTarget[False-True] PASSED [ 30%]
02:34:05 test/integration/clitest/test_import.py::TestImport::testImportLinkableTarget[True-False] PASSED [ 30%]
02:34:11 test/integration/clitest/test_import.py::TestImport::testImportLinkableTarget[True-True] PASSED [ 30%]
02:34:14 test/integration/clitest/test_import.py::TestImport::testBadTargetArgument[Project] PASSED [ 30%]
02:34:15 test/integration/clitest/test_import.py::TestImport::testBadTargetArgument[Plate] PASSED [ 31%]
02:34:17 test/integration/clitest/test_import.py::TestImport::testBadTargetArgument[Image] PASSED [ 31%]
02:34:19 test/integration/clitest/test_import.py::TestImport::testBadModelTargetDiscriminator[Dataset] PASSED [ 31%]
02:34:22 test/integration/clitest/test_import.py::TestImport::testBadModelTargetDiscriminator[Screen] PASSED [ 31%]
02:34:24 test/integration/clitest/test_import.py::TestImport::testDebugArgument[None-ALL] PASSED [ 31%]
02:34:27 test/integration/clitest/test_import.py::TestImport::testDebugArgument[None-TRACE] PASSED [ 31%]
02:34:29 test/integration/clitest/test_import.py::TestImport::testDebugArgument[None-DEBUG] PASSED [ 31%]
02:34:32 test/integration/clitest/test_import.py::TestImport::testDebugArgument[None-INFO] PASSED [ 31%]
02:34:35 test/integration/clitest/test_import.py::TestImport::testDebugArgument[None-WARN] PASSED [ 31%]
02:34:38 test/integration/clitest/test_import.py::TestImport::testDebugArgument[None-ERROR] PASSED [ 31%]
02:34:41 test/integration/clitest/test_import.py::TestImport::testDebugArgument[---ALL] PASSED [ 31%]
02:34:43 test/integration/clitest/test_import.py::TestImport::testDebugArgument[---TRACE] PASSED [ 31%]
02:34:46 test/integration/clitest/test_import.py::TestImport::testDebugArgument[---DEBUG] PASSED [ 31%]
02:34:48 test/integration/clitest/test_import.py::TestImport::testDebugArgument[---INFO] PASSED [ 31%]
02:34:51 test/integration/clitest/test_import.py::TestImport::testDebugArgument[---WARN] PASSED [ 31%]
02:34:53 test/integration/clitest/test_import.py::TestImport::testDebugArgument[---ERROR] PASSED [ 31%]
02:34:56 test/integration/clitest/test_import.py::TestImport::testImportOutputDefault PASSED [ 31%]
02:34:58 test/integration/clitest/test_import.py::TestImport::testImportOutputYaml PASSED [ 31%]
02:35:00 test/integration/clitest/test_import.py::TestImport::testImportOutputLegacy PASSED [ 31%]
02:35:04 test/integration/clitest/test_import.py::TestImport::testImportOutputDefaultWithScreen[1] PASSED [ 31%]
02:35:07 test/integration/clitest/test_import.py::TestImport::testImportOutputDefaultWithScreen[2] PASSED [ 32%]
02:35:10 test/integration/clitest/test_import.py::TestImport::testImportOutputDefaultWithScreen[3] PASSED [ 32%]
02:35:15 test/integration/clitest/test_import.py::TestImport::testImportAsRoot PASSED [ 32%]
02:35:19 test/integration/clitest/test_import.py::TestImport::testImportMultiGroup PASSED [ 32%]
02:35:23 test/integration/clitest/test_import.py::TestImport::testImportAsRootMultiGroup PASSED [ 32%]
02:35:26 test/integration/clitest/test_import.py::TestImport::testNamingArguments[Image] PASSED [ 32%]
02:35:28 test/integration/clitest/test_import.py::TestImport::testNamingArguments[Image-x] PASSED [ 32%]
02:35:31 test/integration/clitest/test_import.py::TestImport::testNamingArguments[Image--description] PASSED [ 32%]
02:35:34 test/integration/clitest/test_import.py::TestImport::testNamingArguments[Image-n] PASSED [ 32%]
02:35:36 test/integration/clitest/test_import.py::TestImport::testNamingArguments[Image-n-x] PASSED [ 32%]
02:35:39 test/integration/clitest/test_import.py::TestImport::testNamingArguments[Image-n--description] PASSED [ 32%]
02:35:42 test/integration/clitest/test_import.py::TestImport::testNamingArguments[Image--name] PASSED [ 32%]
02:35:44 test/integration/clitest/test_import.py::TestImport::testNamingArguments[Image--name-x] PASSED [ 32%]
02:35:48 test/integration/clitest/test_import.py::TestImport::testNamingArguments[Image--name--description] PASSED [ 32%]
02:35:51 test/integration/clitest/test_import.py::TestImport::testNamingArguments[Plate] PASSED [ 32%]
02:35:54 test/integration/clitest/test_import.py::TestImport::testNamingArguments[Plate-x] PASSED [ 32%]
02:35:58 test/integration/clitest/test_import.py::TestImport::testNamingArguments[Plate--description] PASSED [ 32%]
02:36:01 test/integration/clitest/test_import.py::TestImport::testNamingArguments[Plate--plate_description] PASSED [ 32%]
02:36:04 test/integration/clitest/test_import.py::TestImport::testNamingArguments[Plate-n] PASSED [ 32%]
02:36:08 test/integration/clitest/test_import.py::TestImport::testNamingArguments[Plate-n-x] PASSED [ 32%]
02:36:12 test/integration/clitest/test_import.py::TestImport::testNamingArguments[Plate-n--description] PASSED [ 32%]
02:36:16 test/integration/clitest/test_import.py::TestImport::testNamingArguments[Plate-n--plate_description] PASSED [ 33%]
02:36:20 test/integration/clitest/test_import.py::TestImport::testNamingArguments[Plate--name] PASSED [ 33%]
02:36:23 test/integration/clitest/test_import.py::TestImport::testNamingArguments[Plate--name-x] PASSED [ 33%]
02:36:27 test/integration/clitest/test_import.py::TestImport::testNamingArguments[Plate--name--description] PASSED [ 33%]
02:36:31 test/integration/clitest/test_import.py::TestImport::testNamingArguments[Plate--name--plate_description] PASSED [ 33%]
02:36:35 test/integration/clitest/test_import.py::TestImport::testNamingArguments[Plate--plate_name] PASSED [ 33%]
02:36:38 test/integration/clitest/test_import.py::TestImport::testNamingArguments[Plate--plate_name-x] PASSED [ 33%]
02:36:41 test/integration/clitest/test_import.py::TestImport::testNamingArguments[Plate--plate_name--description] PASSED [ 33%]
02:36:44 test/integration/clitest/test_import.py::TestImport::testNamingArguments[Plate--plate_name--plate_description] PASSED [ 33%]
02:36:46 test/integration/clitest/test_import.py::TestImport::testNoThumbnails[--no-thumbnails] PASSED [ 33%]
02:36:48 test/integration/clitest/test_import.py::TestImport::testNoThumbnails[--no_thumbnails] PASSED [ 33%]
02:36:51 test/integration/clitest/test_import.py::TestImport::testSkipArguments[] PASSED [ 33%]
02:36:54 test/integration/clitest/test_import.py::TestImport::testSkipArguments[all] PASSED [ 33%]
02:36:56 test/integration/clitest/test_import.py::TestImport::testSkipArguments[checksum] PASSED [ 33%]
02:36:59 test/integration/clitest/test_import.py::TestImport::testSkipArguments[minmax] PASSED [ 33%]
02:37:01 test/integration/clitest/test_import.py::TestImport::testSkipArguments[thumbnails] PASSED [ 33%]
02:37:04 test/integration/clitest/test_import.py::TestImport::testSkipArguments[upgrade] PASSED [ 33%]
02:37:07 test/integration/clitest/test_import.py::TestImport::testSymlinkImport PASSED [ 33%]
02:37:09 test/integration/clitest/test_import.py::TestImport::testUnknownTarget[Dataset-test.fake--d] PASSED [ 33%]
02:37:12 test/integration/clitest/test_import.py::TestImport::testUnknownTarget[Screen-SPW&plates=1&plateRows=1&plateCols=1&fields=1&plateAcqs=1.fake--r] PASSED [ 33%]
02:37:14 test/integration/clitest/test_import.py::TestImport::testEncryption[] PASSED [ 34%]
02:37:18 test/integration/clitest/test_import.py::TestImport::testEncryption[--encrypted=false] PASSED [ 34%]
02:37:21 test/integration/clitest/test_import.py::TestImport::testEncryption[--encrypted=true] PASSED [ 34%]
02:37:21 test/integration/clitest/test_import.py::TestImport::testBulk PASSED [ 34%]
21:30:24 Build was aborted
21:30:24 Aborted by devspace
21:30:24 Recording test results
21:30:25 test/integration/clitest/test_import.py::TestImport::testParallelUpload
21:30:25 Result: 143
21:30:25
21:30:25 BUILD SUCCESSFUL
21:30:25 Total time: 1154 minutes 36 seconds
21:30:25 + /home/omero/workspace/OMERO-test-integration/src/build.py -f components/tools/OmeroFS/build.xml integration -Dtestreports.dir=target/reports/integration
21:30:25 OpenJDK 64-Bit Server VM warning: Ignoring option MaxPermSize; support was removed in 8.0
21:30:26 ERROR: Step ‘Publish JUnit test result report’ failed: No test report files were found. Configuration error?
21:30:26 Build Aborted. Not looking for any TestNG results.
21:30:26 Finished: ABORTED