Skip to content

Console Output

Started by upstream project "Trigger" build number 407
originally caused by:
 Started by user devspace
Obtained Jenkinsfile from git https://github.com/snoopycrimecop/omero-insight.git
[Pipeline] Start of Pipeline (hide)
[Pipeline] node (hide)
Running on testintegration in /home/omero/workspace/OMERO-insight-build
[Pipeline] { (hide)
[Pipeline] stage (hide)
[Pipeline] { (Declarative: Checkout SCM) (hide)
[Pipeline] checkout (hide)
The recommended git tool is: git
No credentials specified
Cloning the remote Git repository
Cloning repository https://github.com/snoopycrimecop/omero-insight.git
 > git init /home/omero/workspace/OMERO-insight-build # timeout=10
Fetching upstream changes from https://github.com/snoopycrimecop/omero-insight.git
 > git --version # timeout=10
 > git --version # 'git version 2.43.5'
 > git fetch --tags --force --progress -- https://github.com/snoopycrimecop/omero-insight.git +refs/heads/*:refs/remotes/origin/* # timeout=10
Avoid second fetch
Checking out Revision 46a8a8f11561d6bf2bac964b0cfaa0151d69160c (origin/merge_ci)
Commit message: "Update component versions"
First time build. Skipping changelog.
[Pipeline] }
[Pipeline] // stage
[Pipeline] withEnv (hide)
[Pipeline] { (hide)
[Pipeline] withEnv (hide)
[Pipeline] { (hide)
[Pipeline] stage (hide)
[Pipeline] { (Build) (hide)
[Pipeline] sh (hide)
+ gradle --init-script init-ci.gradle publishToMavenLocal build --refresh-dependencies
 > git config remote.origin.url https://github.com/snoopycrimecop/omero-insight.git # timeout=10
 > git config --add remote.origin.fetch +refs/heads/*:refs/remotes/origin/* # timeout=10
 > git rev-parse origin/merge_ci^{commit} # timeout=10
 > git config core.sparsecheckout # timeout=10
 > git checkout -f 46a8a8f11561d6bf2bac964b0cfaa0151d69160c # timeout=10
 > git rev-list --no-walk 979a8cd488d8346548b8c26e4cf57c6f153d6016 # timeout=10
To honour the JVM settings for this build a single-use Daemon process will be forked. See https://docs.gradle.org/6.9.3/userguide/gradle_daemon.html#sec:disabling_the_daemon.
Daemon will be stopped at the end of the build 
> Task :buildSrc:compileJava NO-SOURCE

> Task :buildSrc:compileGroovy
WARNING: An illegal reflective access operation has occurred
WARNING: Illegal reflective access by org.codehaus.groovy.reflection.CachedClass (file:/opt/gradle-6.9.3/lib/groovy-all-1.3-2.5.12.jar) to method java.util.AbstractCollection.hugeCapacity(int)
WARNING: Please consider reporting this to the maintainers of org.codehaus.groovy.reflection.CachedClass
WARNING: Use --illegal-access=warn to enable warnings of further illegal reflective access operations
WARNING: All illegal access operations will be denied in a future release

> Task :buildSrc:pluginDescriptors
> Task :buildSrc:processResources
> Task :buildSrc:classes
> Task :buildSrc:jar
> Task :buildSrc:assemble
> Task :buildSrc:pluginUnderTestMetadata
> Task :buildSrc:compileTestJava NO-SOURCE
> Task :buildSrc:compileTestGroovy NO-SOURCE
> Task :buildSrc:processTestResources NO-SOURCE
> Task :buildSrc:testClasses UP-TO-DATE
> Task :buildSrc:test NO-SOURCE
> Task :buildSrc:validatePlugins
> Task :buildSrc:check
> Task :buildSrc:build

FAILURE: Build failed with an exception.

* What went wrong:
A problem occurred configuring root project 'omero-insight'.
> Could not resolve all artifacts for configuration ':classpath'.
   > Could not find org.jfrog.buildinfo:build-info-extractor:2.13.3.
     Searched in the following locations:
       - file:/home/omero/.m2/repository/org/jfrog/buildinfo/build-info-extractor/2.13.3/build-info-extractor-2.13.3.pom
       - https://repo.maven.apache.org/maven2/org/jfrog/buildinfo/build-info-extractor/2.13.3/build-info-extractor-2.13.3.pom
       - https://artifacts.openmicroscopy.org/artifactory/maven/org/jfrog/buildinfo/build-info-extractor/2.13.3/build-info-extractor-2.13.3.pom
       - http://nexus:8081/nexus/repository/maven-internal/org/jfrog/buildinfo/build-info-extractor/2.13.3/build-info-extractor-2.13.3.pom
       - https://plugins.gradle.org/m2/org/jfrog/buildinfo/build-info-extractor/2.13.3/build-info-extractor-2.13.3.pom
     Required by:
         project : > org.openmicroscopy.additional-repositories:org.openmicroscopy.additional-repositories.gradle.plugin:5.5.1 > org.openmicroscopy:omero-artifact-plugin:5.5.1 > org.jfrog.buildinfo:build-info-extractor-gradle:4.9.3

* Try:
Run with --stacktrace option to get the stack trace. Run with --info or --debug option to get more log output. Run with --scan to get full insights.

* Get more help at https://help.gradle.org

Deprecated Gradle features were used in this build, making it incompatible with Gradle 7.0.
Use '--warning-mode all' to show the individual deprecation warnings.
See https://docs.gradle.org/6.9.3/userguide/command_line_interface.html#sec:command_line_warnings

BUILD FAILED in 16s
[Pipeline] }
[Pipeline] // stage
[Pipeline] stage (hide)
[Pipeline] { (Deploy) (hide)
Stage "Deploy" skipped due to earlier failure(s)
[Pipeline] getContext (hide)
[Pipeline] }
[Pipeline] // stage
[Pipeline] stage (hide)
[Pipeline] { (Declarative: Post Actions) (hide)
[Pipeline] deleteDir (hide)
[Pipeline] }
[Pipeline] // stage
[Pipeline] }
[Pipeline] // withEnv
[Pipeline] }
[Pipeline] // withEnv
[Pipeline] }
[Pipeline] // node
[Pipeline] End of Pipeline
ERROR: script returned exit code 1
Finished: FAILURE